bte-1079 verification 2026-10-02 20:31:48 UTC
RE-VERIFY: This is a write-time snapshot. Re-read https://buildtest.kotlin.build/api/runs, verify https://github.com/CodexCoder21Organization/BuildTestEmbedded/pull/1079 with gh pr view 1079 --repo CodexCoder21Organization/BuildTestEmbedded --json state,headRefOid,mergeStateStatus,statusCheckRollup,mergedAt, and compare refs with git ls-remote before acting. The retained older snapshots below remain historical evidence.
Remaining work first: Resolve the recurring shared-cache preparation deadline shown by https://buildtest.kotlin.build/run?id=320deef5, then resume the current PR source rebase, local projection tests and one five-check CI run. Delegate bte-1079 stopped at the lane's explicit preparation-failure gate. No PR source or description was changed, and no new CI run was submitted.
OBSERVED: Run 320deef5 started 2026-10-02 14:35:14.857 UTC and ended FAILED 15:00:50.363 UTC. All ten shards report TIMEOUT: Shared workspace module cache preparation exceeded its deadline. Elapsed: 1200000ms; Deadline: 1200000ms. The run lists 3332 tests, 0 passed and 0 failed; this is an infrastructure verdict before tests. Earlier same-day runs https://buildtest.kotlin.build/run?id=2a6a10b9 (58 passed, 0 failed) and https://buildtest.kotlin.build/run?id=0c4e9b11 (185 passed, 17 failed) reached tests, but the later preparation failure means the condition still recurs. Later https://buildtest.kotlin.build/run?id=06874ebe and https://buildtest.kotlin.build/run?id=3c8cd6ec were canceled with zero executed tests. The list flags outOfDate=true and refreshFailing=true; direct results read returned HTTP 503. Preserve this evidence limitation; the underlying preparation mechanism remains unknown.
OBSERVED: The original preparation dependency is marked completed (GREEN), but that status does not account for today's later preparation failure. The September 28 usage-limit snapshot also does not describe current PR state. https://github.com/CodexCoder21Organization/BuildTestEmbedded/pull/1079 is OPEN and DIRTY at 6e9cc231a8222adc199b6d536191029f8beceb0a; all five Actions checks succeeded September 30 in https://github.com/CodexCoder21Organization/BuildTestEmbedded/actions/runs/36759544006. Current main is f3efa847c6e78233cd006f42528bd6534a578c26. https://github.com/CodexCoder21Organization/BuildTestEmbedded/pull/1192 merged at 2026-10-02T11:19:00Z. The current PR source has later startup, shutdown, repair, cursor, compiler selector and JSON work fixes; preserve these when rebasing rather than restoring the older q05/o02g source over them.
OBSERVED: Latest PR commit date is September 30 18:34:21Z; latest comment date is September 30 05:21:21Z. Neither triggers the lane's other-session guard. Fresh clone path: /tmp/claude-501/-code/4719c767-3557-4cb1-90f8-28975c4c3602/scratchpad/workspace/bte-1079/BuildTestEmbedded. No root AGENTS.md exists. No local tests or builds ran: 0 passed, 0 failed, 0 executed. No product/test code changed. No merge, queue action, deployment, restart or Maven publication occurred.
Added and refreshed refs
| Repo |
Branch |
Verified remote SHA |
PR |
Contents / current state |
| BuildTestEmbedded |
wip/bte-1079-2026-10-02 |
92ddbc4693f45d18e68e3dad574d984086475d07 |
none |
Evidence-only checkpoint on current main; findings and run-list evidence. Pushed SHA equals local HEAD. |
| BuildTestEmbedded |
wip/L1-reset-storm |
6e9cc231a8222adc199b6d536191029f8beceb0a |
https://github.com/CodexCoder21Organization/BuildTestEmbedded/pull/1079 |
OPEN, DIRTY, five old-base Actions checks SUCCESS; untouched by bte-1079. |
| BuildTestEmbedded |
wip/o02g-projection-retention-ci-round1 |
3801c4dbc4fabd16e8e3656a3b8bf351fc4f2790 |
none |
Historical source, re-verified unchanged. |
| BuildTestEmbedded |
wip/o02g-quota-stop-20260928 |
3801c4dbc4fabd16e8e3656a3b8bf351fc4f2790 |
none |
Historical source, re-verified unchanged. |
Next steps from this verification
- Have the preparation owner investigate run 320deef5 before treating the completed dependency as clearance. Do not attribute it to host load or a product test without mechanism evidence. No new remote run was launched by this lane.
- Once the preparation gate is cleared, verify PR activity and source again, rebase the current PR source onto live main, inspect startup load overlap, and run targeted in-process projection tests through the shared-slot helper.
- Confirm OPEN, push the tested PR source with force-with-lease, update the why-first description with handoff links and evidence, and watch a single CI run without --to-merged. The supervisor owns final review, merge/enqueue decisions and handoff completion.
Operational note: report-challenge-cli was not invoked because its documented automatic enqueue and merge violate this lane's explicit hard rules; the challenge is preserved on the evidence branch instead.
Quota-stop snapshot 2026-09-28 18:13 UTC
RE-VERIFY banner (added 2026-09-28 18:25 UTC by fable-code-2026-09-28): everything below this banner is a write-time snapshot taken when the supervising session stopped because its codex delegates hit the account usage limit (reset 2026-10-05 05:43 UTC); re-check every PR with gh pr view <n> --repo <owner>/<repo> --json state,mergeStateStatus,headRefOid,statusCheckRollup and every branch with git ls-remote before acting. Session artifacts (lane briefs lanes/*.md, findings out/*-findings.md, review verdicts out/r*-verdict.md, the supervisor's review log out/supervisor-reviews.md, slot queue out/followups.tsv) are at https://github.com/CodexCoder21Organization/PlanRepository/tree/handoffs-artifacts/2026-09-28-fable-board-drain-quota-stop/handoffs/artifacts/2026-09-28-fable-board-drain . The board-level resume procedure lives in the handoff titled "Resume the open-handoff drain". The shared droplet service dropped its RPC connection twice (17:13–17:18 and again about 18:04 UTC), failing every remote run in those windows before any test executed; runs that report zero tests executed with a provisioning error are infrastructure verdicts, not code verdicts.
State: https://github.com/CodexCoder21Organization/BuildTestEmbedded/pull/1079 OPEN at 76195ba0 (branch wip/L1-reset-storm), four Actions shards FAILURE on that head. Lane o02g's verified-so-far fix is on wip/o02g-projection-retention-ci-round1 = wip/o02g-quota-stop-20260928 at 3801c4db (seven files, +25/−10, four targeted fixes; never pushed to the PR branch). Evidence: terminalUtilizationPageCallbackAndAppendAdmissionDoNotDeadlock passed first attempt in 2,922 ms (--remote, XML in artifacts out/o02g-terminal.xml) versus four pre-fix failures; testProjectionLockAcquisitionsUseScopedMember passed solo in 16.5 s (28 s inside the six-selector run 40c6055a); the compiler-matrix test was split into two standalone selectors (one test per .kts file, per TESTING.md) and pushed, but their two-selector remote run had no verdict when the session stopped. The retention test's new explicit third argument (legacy-byte-bound) has one call site.
Next steps: fresh-clone that branch, re-run the two split compiler selectors plus the retention and terminal selectors remotely (verdict by run id from the results API), rebase on origin/main, push to the PR branch with --force-with-lease, get the four shards green, then reviews, the supervisor's final review, and enqueue. Never reduce the 128 MiB heap, 8 MiB cache, or exact row assertions.
Handoff: Complete the BuildTestEmbedded projection-retention PR at https://github.com/CodexCoder21Organization/BuildTestEmbedded/pull/1079
Written 2026-09-27 17:31 UTC. RE-VERIFY: Every state below is a write-time snapshot. Recheck the PR with gh pr view 1079 --repo CodexCoder21Organization/BuildTestEmbedded --json state,mergeStateStatus,statusCheckRollup,mergedAt,headRefOid, refresh refs with git fetch origin, and compare all branch tips with git ls-remote. Check the remote run with ~/bin/coursier launch buildwatchman:build-watchman:0.0.18 -r https://kotlin.directory -- --run f482c55e. A fresh query wins over this document.
Mission summary
The owner asked for the cause of slow projection updates in BuildTest to be fixed: after restart or compaction, readers of the persisted change journal were forced to reload everything, and snapshot copies could grow without bound. The requested PR retains enough journal history for readers to continue incrementally, reclaims abandoned journal row files at startup, and caps reset snapshot generations at eight. This lane was to run one full remote suite, push the tested source to wip/L1-reset-storm, update the PR body with accurate test and fixture evidence, and watch bld-build plus four bld-test-shard checks. No merge or enqueue is allowed.
What was found and done
- q05 completed the implementation and targeted verification at
dc10f58e645b16e54689f2c088d92bedac11456d. It rebased on main 8d76d0024, pushed its source branch, and recorded red-before-green evidence plus four fixture setup re-expressions while retaining their behavioral assertions. Its findings are archived at https://github.com/CodexCoder21Organization/PlanRepository/blob/wip/q08-remote-suite-findings-2026-09-27/handoffs/artifacts/q08/q05-findings.md. That report also establishes that the caught-up-cursor test passes on main after https://github.com/CodexCoder21Organization/BuildTestEmbedded/pull/1111; the PR body must not claim current main resets a caught-up reader.
- q08 cloned the repository fresh, read its README, found no root AGENTS.md, read the required test, state-management, philosophy, slow-service, and utilization documents, fetched current refs, and confirmed the q05 source was based on the main head then available. No q08 product code was changed.
- q08 ran the full suite once remotely from
dc10f58e645b16e54689f2c088d92bedac11456d with scripts/test.bash --remote --test . --log /tmp/claude-1000/-code/50fdf0b6-d89e-42ff-8356-33fffc39f1da/scratchpad/out/q08-full-suite.xml. Run f482c55e ended FAILED: all ten shards hit the 20-minute shared workspace module-cache preparation deadline before tests. The API listed 2,816 tests, 0 passed, and 0 failed tests. The XML was not produced, so there are no failed <attempt-history> entries to list. This does not establish a product-test failure or why preparation missed its deadline.
- The outside wait exceeded 30 minutes, so q08 stopped under the lane rule. It did not start a second run or switch this BuildTestEmbedded full suite to local execution. A dedicated blocker handoff exists at
url://handoff/handoffs/hf-2026-09-27-resolve-the-remote-buildtest-workspace-module-cache-preparation-timeout and https://www.handoff.wasmserver.com/handoffs/hf-2026-09-27-resolve-the-remote-buildtest-workspace-module-cache-preparation-timeout. This work depends on resolving that exact preparation failure.
- At the latest check, the PR was OPEN at the old head
ef78fd1212add6e2a288f937c527dde10f2918ed, with mergeStateStatus=DIRTY; its five failures came from workflow run 36295206936 on that old head. Main had moved to 1b80be83cd44836d9b1c7e4bebe40eb5b5b4093c. The q05/q08 source must be rebased onto live main before its next full-suite run. No q08 source was pushed to the PR branch, its description was not edited, and no checks on the tested source head were watched.
- The report-challenge CLI was not invoked because its documented behavior enqueues and merges a PR, which the lane prohibits. HCF access was unavailable because the client certificate file is missing; SSH was used only for read-only host log metadata. No production deployment or Maven publication was performed.
Relevant PRs / refs
| Repo |
Branch |
Remote head SHA |
PR |
What is on it |
State at write time |
| BuildTestEmbedded |
wip/q05-reset-retention-2026-09-27 |
dc10f58e645b16e54689f2c088d92bedac11456d |
no PR for this branch |
q05 projection-retention source and targeted checks |
Targeted evidence is in the linked q05 findings. Remote suite did not reach tests; rebase required because main moved to 1b80be83. |
| BuildTestEmbedded |
wip/q08-projection-retention-2026-09-27 |
dc10f58e645b16e54689f2c088d92bedac11456d |
no PR |
q08 checkpoint of the same source |
Pushed and verified with git ls-remote; not updated in q08. |
| BuildTestEmbedded |
wip/L1-reset-storm |
ef78fd1212add6e2a288f937c527dde10f2918ed |
https://github.com/CodexCoder21Organization/BuildTestEmbedded/pull/1079 |
Existing PR branch |
OPEN, DIRTY, old-head checks failed; q08 made no changes to this ref. |
| PlanRepository |
wip/q08-remote-suite-findings-2026-09-27 |
16bf6de4c22e30a4c613d3438e6944c2a908f4f1 |
no PR |
q08 evidence archive |
Pushed and verified. Includes prompt, q05/q08 findings, run log, and unpublished PR-body draft. |
No code was deployed or published in this effort.
Next steps
- Re-verify all refs and the open PR. Resolve the remote preparation blocker at https://www.handoff.wasmserver.com/handoffs/hf-2026-09-27-resolve-the-remote-buildtest-workspace-module-cache-preparation-timeout.
- Rebase the source onto current
origin/main, then run one full remote suite from that exact commit after the preparation failure is addressed. Save and inspect the XML; if tests start and fail, classify actual failing tests against the same single test on main as the original brief directs.
- After the full-suite gate passes, confirm the PR is still OPEN, push the tested source to
wip/L1-reset-storm with --force-with-lease, and update then re-read the PR description. Keep the why-first opening and record the q05 fixture setup before/after while retaining each assertion. Do not claim that current main resets a caught-up reader.
- Use the
watch-build skill without --to-merged to watch bld-build and all four bld-test-shard checks on the final source head. Stop at the 60-minute post-push cutoff if they have not finished. Do not merge, enqueue, deploy, or publish.
Reusable / operational knowledge
- Use
~/bin/coursier; /usr/local/bin/coursier is the wrong-architecture binary according to the lane brief.
- The full q08 output and exact run context are at https://github.com/CodexCoder21Organization/PlanRepository/tree/wip/q08-remote-suite-findings-2026-09-27.
- HCF could not run because
/home/helena/.config/hardware-control-fabric/fabric-client-cert.pem is missing. The q08 fallback read host logs only.
- The specific q08 rule requires BuildTestEmbedded full suites to run remotely; it does not authorize switching this repository's full suite to local execution after the cache-preparation deadline.