← Priority list
Blocked

Finish the remaining membership selectors and final suite gate

Collect the remaining first-attempt regression results, qualify the remote suite, then update the canonical PR; candidate rebase is unchanged and the restored-space attempt is queued.

Supervisor ruling required on the inherited interrupted-reader fixture expectation; the concrete startup-ordering proposal preserves all existing assertions and bounds.

Handoff document

Markdown

Finish the remaining membership selectors and final suite gate

RE-VERIFY: 2026-10-09 05:40 UTC. Active run-13 snapshot. Claim fable-hq-20261004 verified LIVE. Canonical PR remains OPEN at 83121a2a3cb5df1553afdc00d3c16800eaebc752 with two failed old checks. Run-13 instructions control: use the existing candidate checkout, execute remaining selectors one per JVM-slot admission, and submit at most one remote suite only if the run list shows a COMPLETED run started after 05:30 today. Supervisor dispatches reviews and owns merge, enqueue, deploy, publication and completion.

Current progress

Fetch/rebase is complete with no changes: main f87fd2d969d2c78b3a17104f7ca65583f5ca012a; candidate 1a6934ba1f4e0b125c39c8ea1097d7d78fb107ba, still recoverable on https://github.com/CodexCoder21Organization/BuildTestEmbedded/tree/wip/L43-twelfth-candidate. All 38 commits compare unchanged. The previous selector-16 failure was the explicit free-space admission check (3,965,558,784 usable bytes versus 5,368,709,120 required), not a membership assertion and not a literal ENOSPC stack. Disk now has about 45 GiB free. Its authorized post-restoration first attempt is queued; no new test result yet. Fourteen remaining selectors are queued in order, acquiring and releasing jvm-slot individually, with an 1800-second bound inside each acquisition and an overall 08:00 stop. No source edits or remote submissions.

Evidence: https://github.com/CodexCoder21Organization/BuildTestEmbedded/tree/wip/L43-thirteenth-evidence, head bb08a6d56 (verify latest). review/L43/thirteenth-invocation carries live claim, PR inventory, handoff, no-change range-diff and findings. The initial API run-list response is marked outOfDate and contains no qualifying completion; it does not permit remote submission.

Remaining work

  1. Collect post-restoration selector and fourteen first attempts; classify failures before fixing or repeating anything.
  2. Recheck the remote prerequisite; one full suite only if eligible, otherwise CHECKPOINT with local evidence.
  3. Only after required gates, recheck canonical OPEN/duplicates, rebase, push canonical with lease, and update WHY-first description and classification table.
  4. Supervisor reviews and landing decisions remain.

Previous chain and complete reference inventory

Finish membership regression checks and update the pull request

RE-VERIFY: 2026-10-09T05:26:02.836253+00:00. Re-fetch claims, PR heads/checks and branch tips. The supervisor alone owns merge, enqueue, deploy, publication and handoff completion.

Mission and original request

Finish complete reset membership certification in https://github.com/CodexCoder21Organization/BuildTestEmbedded/pull/1127. The original three public-API failures are described at https://github.com/CodexCoder21Organization/BuildTestEmbedded/pull/1127#issuecomment-5882849007. Consumers absent beyond tombstone retention need complete current membership, including archived runs, before deleting absent IDs. The historical findings and references below remain evidence, not instructions to merge or deploy.

Current chain of findings — run 12

  1. Claimed as fable-hq-20261004. Canonical PR remains OPEN at 83121a2a; its old first-attempt CI failures retain the run11 classifications. All referenced PR states were rechecked; three satellites remain open and their supporting fixes are merged. No duplicate membership PR was found and no closure is recommended. Main still has no runMembershipComplete implementation.
  2. Restored the 35-commit series, rebased onto current main, and applied the newly approved publication-wait fixture patch. The interrupted-reader patch was already in the replay. Both preserve every legacy row, assertion and bound; no production code was changed for them.
  3. Publication-wait proof is COMPLETE: fixed first executed attempt on d93955e passed 1/0 in 20,746 ms. Original canonical CI first-attempt expected 500/actual 1 remains the before-evidence and was not rerun. The single deliberate early-startup-release experiment on exactly the same d93955e production failed 0/1 in 9,691 ms on The committed snapshot must fill the requested page.. Expected <500>, actual <1>. Its XML also records reset positions 2001/2001. Full XML/logs and the diagnostic patch are preserved; the negative variant was discarded from the source checkout.
  4. Main advanced during the invocation through 3ace41de and 411c10c8 to f87fd2d969d2c78b3a17104f7ca65583f5ca012a. The legacy compatibility test and selective discovery correction make 38 commits; the current candidate is 1a6934ba1f4e0b125c39c8ea1097d7d78fb107ba. All rebases were clean and range-diffs are preserved. Earlier-head results are not exact-head full-suite verdicts for this newer candidate.
  5. The first resume selector, testProjectionBaselineSupplementationReadsOnlyForgottenSources, FAILED on its first executed attempt at 1dd7e411 in 7,968 ms: expected [0,0] paged-row reads, actual [51,483]. This proves the series-caused regression: two staged-row membership scans plus the full captured-journal legacy-discovery scan. Exact failure, XML and compressed log are preserved; the failing head is on wip/L43-twelfth-discovery-baseline. No unchanged-code rerun.
  6. The no-fingerprint legacy compatibility case passed before the correction (11195 ms) and first on the correction (8585 ms). The unchanged zero-read guard passed first on the correction (3992 ms); callback-close passed first (8049 ms); the one-lost-source work guard passed first (15619 ms), preserving exact [1,1] reads at N/10N. All corrected results are at 1a6934ba1f4e0b125c39c8ea1097d7d78fb107ba. Full first-attempt XML/logs are pushed.
  7. The original fingerprinted legacy case failed first before its target behavior (8758 ms): initial createUploadSession saw 3965558784 usable bytes, below its configured 5368709120-byte storage margin. This is an execution-environment precondition, not a membership assertion failure. No rerun or fixture/margin alteration. The shared filesystem remained below the margin; no further fixtures were submitted against that known condition. Three of the 18 resume selectors passed, one has this classified environment failure, and fourteen remain unexecuted.
  8. Separate test-comprehensiveness and adversarial code-review passes are written in the evidence findings. The indexed correction has four focused passes including the additional no-fingerprint test, but lifecycle/integration verification remains unfinished. Zero remote runs were submitted. Canonical was not updated. All 65 historical branch references still resolve; current heads were saved. No PR/branch closures are recommended. Nothing was merged, enqueued, deployed, published, completed or released.

Relevant current PRs / refs

Ref Full head State / purpose
https://github.com/CodexCoder21Organization/BuildTestEmbedded/pull/1127 83121a2a3cb5df1553afdc00d3c16800eaebc752 OPEN; old shard1 and bld-build failure, other 3 shards success; canonical unchanged.
https://github.com/CodexCoder21Organization/BuildTestEmbedded/tree/wip/L43-twelfth-candidate 1a6934ba1f4e0b125c39c8ea1097d7d78fb107ba Current 38-commit candidate; indexed discovery has four focused passes; 18-selector gate remains incomplete after a disk-space precondition failure.
https://github.com/CodexCoder21Organization/BuildTestEmbedded/tree/wip/L43-twelfth-publication-proof d93955e360a112a67a74c1f2bc07c3f9a912635c Exact passing production for the controlled positive/negative comparison; keep as evidence, not separate merge.
https://github.com/CodexCoder21Organization/BuildTestEmbedded/tree/wip/L43-twelfth-evidence b63e49460812ec32f09d15c1527c1cd509becbb3 Positive/negative XML and logs, full traces, replay/range-diffs, reviews, first-attempt launchers; re-read latest tip.
https://github.com/CodexCoder21Organization/BuildTestEmbedded/tree/wip/L43-twelfth-discovery-baseline 1dd7e411f8f552e0130b82f320a764b1dbf49f65 Exact first failing zero-read guard; keep as before-evidence, not a separate merge.

Next steps

  1. Read review/L43/twelfth-invocation/RESUME.md, selector-results.md and the two review sections in the evidence findings. Restore the complete 38-commit candidate from its pushed branch, fetch/rebase and preserve any range-diff. Do not repeat the completed negative-ordering experiment or unchanged failing discovery baseline.
  2. Restore sufficient free space for the existing 5368709120-byte storage margin. The supervisor decides the next valid execution of the original legacy selector after its recorded environment failure. Do not lower the margin or alter the fixture to obtain green.
  3. Run the fourteen unexecuted resume selectors once, one selector per JVM admission, and classify any failure before a correction or rerun. Keep all assertions, bounds and counts. No remaining selector is waived.
  4. Only after all 18 qualify, run one exact-head full remote suite if the pool is calm; otherwise record pool counts and checkpoint. Re-check duplicate/open PR state, rebase, update the WHY-first canonical PR, and wait for all required checks to be green. No canonical update is qualified by the current targeted results alone.
  5. Supervisor final review, merge and handoff completion remain after those gates. No merge, enqueue, deploy, publish, complete or release is authorized to the lane.

Current first-attempt selector evidence

Selector Executed evidence this invocation
testProjectionBaselineSupplementationReadsOnlyForgottenSources FAIL, 7968 ms (selector-01-baseline-supplementation.xml); PASS, 3992 ms (selector-01-fixed.xml)
projectionCompactionReentrantCloseIsRefusedTest PASS, 8049 ms (selector-02.xml)
projectionConcurrentTailRefreshProcessStopPreservesCommittedWave Not executed
projectionMaintenanceBaselineCollectionFailurePreservesCommittedState Not executed
projectionMaintenanceReplacementStagingFailurePreservesCommittedState Not executed
testProjectionEmptyRecoveredJournalRetriesUnobservedRunMembership Not executed
testProjectionInvalidRunRecoversWithoutOtherActivity Not executed
testProjectionMembershipObservationClosesWithService Not executed
testProjectionReadRechecksStartupAfterMembershipWait Not executed
testProjectionRunDirectoryListingRecoversAfterRepeatedObservationFailure Not executed
testProjectionUnchangedIncompleteMembershipDoesNotRecompact Not executed
testProjectionUnchangedInvalidMembershipDetectsSameVersionRepair Not executed
testStartupSweepPublicStateMatchesMain Not executed
projectionPageInterruptedReadPreservesAdvertisedResetTest Not executed
testProjectionLostSourceSupplementationReadsOnlyMatchingRows PASS, 15619 ms (selector-15.xml)
testProjectionLegacyChildRowsFollowCurrentMembershipAndReplacement FAIL (infrastructure: storage precondition), 8758 ms (selector-16.xml)
e2eStalledCreateReleasesAdmissionAndRelaunches Not executed
projectionBaselineRowObserverCloseCompletes Not executed

Additional controlled proofs:

  • projectionPageAdvertisedResetCommitsWhenCallerInterruptedAfterPublicationWaitTest: PASS, 20746 ms (publication-fixed.xml); FAIL, 9691 ms (publication-broken-ordering.xml)
  • testProjectionLegacyChildRowsWithoutFingerprintsFollowMembership: PASS, 11195 ms (legacy-unfingerprinted-before-fix.xml); PASS, 8585 ms (legacy-unfingerprinted-fixed.xml)

Live PR checks at the final reference check

PR Live head State / checks
https://github.com/CodexCoder21Organization/BuildTestEmbedded/pull/1127 83121a2a3cb5df1553afdc00d3c16800eaebc752 OPEN; 2 FAILURE, 3 SUCCESS
https://github.com/CodexCoder21Organization/BuildTestEmbedded/pull/1197 4cfe2b2e761125aa7eb4932efa44cf3f09aae525 MERGED; 5 SUCCESS
https://github.com/CodexCoder21Organization/BuildTestEmbedded/pull/1198 3a7293e1d73b8a9be56a48d91ec06e8aa84c3042 OPEN; 5 FAILURE
https://github.com/CodexCoder21Organization/BuildTestEmbedded/pull/1216 4974f64b2dade29bde5274d2c27a587c8a743634 OPEN; 3 FAILURE, 2 SUCCESS
https://github.com/CodexCoder21Organization/BuildTestEmbedded/pull/1228 2f89862024bf38c0d2840bbe9b5470007833df39 OPEN; 4 FAILURE, 1 SUCCESS
https://github.com/CodexCoder21Organization/BuildTestEmbedded/pull/1235 4db77d73cd2c9f76fa0e8d0d244e6fd31a9349ae MERGED; 5 SUCCESS
https://github.com/CodexCoder21Organization/BuildTestEmbedded/pull/1240 60e950ae84f627d854f90ec115f918179d5e3c4b MERGED; 5 SUCCESS
https://github.com/CodexCoder21Organization/BuildTestEmbedded/pull/1244 9dc242d84207aa3e53a5aeba198d138e38760acb MERGED; 5 SUCCESS
https://github.com/CodexCoder21Organization/BuildTestEmbedded/pull/1248 4dd5f2731a4f4fff6a106b39a4ff6cbebc219295 MERGED; 5 SUCCESS
https://github.com/CodexCoder21Organization/BuildTestEmbedded/pull/1249 321ced9e6ab6712585fd563ed5451852c5f6bb9c MERGED; 5 SUCCESS
https://github.com/CodexCoder21Organization/BuildTestEmbedded/pull/1251 461fdf0952f5b0c098328a5264c788a20f3dad17 MERGED; 5 SUCCESS
https://github.com/CodexCoder21Organization/BuildTestEmbedded/pull/1252 e47118fc102e31a6e7bb1d93172f907af93a1548 MERGED; 5 SUCCESS
https://github.com/CodexCoder21Organization/BuildTestEmbedded/pull/1256 7966e6bbcaef840cb7d6eea2e9c4bea7018f8b05 MERGED; 5 SUCCESS
https://github.com/CodexCoder21Organization/BuildTestEmbedded/pull/1258 5fd63f2adbd6eb768181826ccfc94af5e8188b71 MERGED; 5 SUCCESS
https://github.com/CodexCoder21Organization/BuildTestEmbedded/pull/1340 0279e3ef6aa79c3a544b327302faecee83ea03ec MERGED; 5 SUCCESS

Operational knowledge

The 04:50 body update failed all three bounded attempts; its exact text and errors are saved. The 05:00 RUNNING report succeeded. Final update outcome is recorded in findings. The lane claim remains fable-hq-20261004. No task test process remains after cleanup.

Local candidate: /code/ws/L43/BuildTestEmbedded-twelfth. Evidence: /code/ws/L43/BuildTestEmbedded-twelfth-evidence. Admission is bounded separately from the unchanged 1800-second execution budget after jvm-slot admission. Public launcher sets maxTestAttempts=1. Each cancelled admission had no children, empty log and zero test executions; records are retained. A bounded capacity watcher may replace only such an unadmitted request when the unmodified launcher's second slot is free below its memory threshold; it never restarts an admitted command. The first cold preparation took about 13 minutes, the cached negative about 2 minutes including its test. Use the saved launchers; never a full local suite. Zero remote runs submitted. Handoff transport retries are at most 3; final report/upload outcomes are in findings. Canonical PR has not been pushed or rerun.

Historical record (superseded where current findings say otherwise)

Handoff: Finish current-main membership integration and regression gates

RE-VERIFY: 2026-10-09 02:43 UTC. All states are write-time snapshots. Re-fetch the live handoff claims, GitHub PR heads/checks/queue state, and remote branch heads before acting. The supervisor owns every merge, enqueue, production deploy, artifact publication and handoff completion.

Mission and original request

Finish complete reset membership certification and regression verification in https://github.com/CodexCoder21Organization/BuildTestEmbedded/pull/1127. The original request corrects the three public-API failures at https://github.com/CodexCoder21Organization/BuildTestEmbedded/pull/1127#issuecomment-5882849007. A consumer absent beyond tombstone retention needs a complete list of current run IDs, including archived members, before deleting IDs absent from that list. Run 10 addressed the independent review findings and uncovered one additional inherited fixture contract conflict requiring a ruling.

Run 11 current checkpoint

The supervisor approved the exact interrupted-reader ordering patch from run10. It is applied and pushed on the comparison branch; do not ask for that approval again. The separate publication-wait test was not named in the ruling.

  • Canonical https://github.com/CodexCoder21Organization/BuildTestEmbedded/pull/1127 remains OPEN at83121a2a3cb5df1553afdc00d3c16800eaebc752 with bld-build and shard1 failed. All12 first-attempt failures in https://github.com/CodexCoder21Organization/BuildTestEmbedded/actions/runs/37322523400 are classified: two PR/fixture cases, seven same-test failures proven on main first attempts, and three free-space admission failures. Full traces and references: https://github.com/CodexCoder21Organization/BuildTestEmbedded/blob/wip/L43-eleventh-evidence/review/L43/eleventh-invocation/ci-classification.md. No failed check was rerun.
  • The approved12-line ordering addition is preserved at https://github.com/CodexCoder21Organization/BuildTestEmbedded/tree/wip/L43-eleventh-interrupted-ordering, a3b3fedc049880d1acdd5e8b99685b132bd9f0e2. It retains old-head production for a controlled comparison, all2000 legacy rows, four readers and every assertion/bound. A fresh local baseline command ended at its1800-second outer bound before any test ran; it supplies zero test results. The preserved old-head CI first attempt supplies the observed incomplete-versus-certified-reset failure. The fixed first executed local attempt passed in 8301 ms (1 pass, 0 failures, maxTestAttempts=1), with raw XML and full compressed log on the evidence branch. Its JVMs exited. Current-main selected proof results remain separate.
  • All34 existing commits plus the approved patch were rebased onto mainc91873dd, then onto current main09770c9c1e1052fef76c80bedb506fa087c450c8. The prior diagnostic candidate was9a64cd9a1e142e2ea017fcc60ecb13c34c399bc2. Final main is0be27701e9c3e236afddd7ec15bd2d080591e6b0; the final unverified candidate is1a4a88ad43e70b46b765ae18ec14bfe13865f8eb. Its complete replay series is rebased-series-main0be2770.patch (git am onto0be27701e9c3e236afddd7ec15bd2d080591e6b0). The earlier09770 candidate remains preserved as rebased-series-main09770.patch on the evidence branch (git am onto09770c9); the earlier c918 series is retained separately. Neither unverified integration candidate replaces the canonical PR head.
  • Main https://github.com/CodexCoder21Organization/BuildTestEmbedded/pull/1340 added indexed source reads and exact work guards. Membership recovery still scans captured rows for journal-only legacy TEST_STATUS_UPSERT records and re-reads staged rows for membership sets. The content-preserving rebase keeps legacy semantics and main's selective supplementation, but those discovery reads need a compatibility correction proven by main's unchanged testProjectionBaselineSupplementationReadsOnlyForgottenSources. This is a source-backed hypothesis awaiting the first-attempt experiment. Preserve legacy child replacement and newest lost-run behavior; do not discard either contract. Detailed experiment and review findings are saved on the evidence branch.
  • Separate decision: projectionPageAdvertisedResetCommitsWhenCallerInterruptedAfterPublicationWaitTest seeds2000 legacy duplicate rows for one run, then expects two500-row pages after startup may have certified one current row. First-attempt CI reports expected500 actual1 at recovered sequence2001. Its exact fixture is unchanged on main. The concrete unapplied publication-wait-fixture-proposal.patch on the evidence branch holds startup through the existing caller interruption and page checks. Recommend approving that ordering repair without changing any data/assertion/bound. The lane rule requires a ruling before changing this separate fixture.
  • Own source test-comprehensiveness and adversarial passes are recorded as source reviews, not readiness verdicts. The 13 requested current-candidate proofs and new-main integration guards remain unverified. Both guard commands ended during preparation with zero executed tests: the first at its1800-second outer deadline and the final at02:40. No current-main assertion was reached, and no runtime confirmation of the indexed-read hypothesis is claimed. The earlier explicitly permitted legacy-uncertified/publication-Error coverage gap is unchanged. Zero remote suites submitted; the full exact-head suite is not justified while known fixture/integration work remains.

Historical findings through run 10

  1. Prior membership and archive-fold corrections remain in the canonical branch. The source-observation timer still forced full compaction every second when a run directory had no valid run.json. Public tests with an advancing ManualClock failed first: missing source produced 61 publications instead of 1; invalid source produced 4 instead of 1. A third test proved that reading startup completion before the membership wait returns stale state on the same read.
  2. Membership observation now compares source content with the last successfully published incomplete baseline. An unchanged observation does not request collection or compaction; changed content or an observation failure reaches the authoritative collector. Digest reuse follows the existing conservative timestamp boundary, so a same-size/same-time repair inside the uncertain timestamp window is detected. Complete publication alone certifies membership. The first candidate exposed a redundant initial observed-source mark that caused a second rewrite; that call was removed and re-verified.
  3. Empty-cursor reads now refresh startup completion after their membership wait. Both optional-maintenance-failure tests again check exact foreign-cursor reset pages, retaining their existing ordinary-page checks. The child halt fixture has a bounded wait below its unchanged parent limit. The CLI pin and portable fixture packaging have a reason-first justification in the PR, including the original exact SystemClock failure and upstream correction. The requested motivation paragraph and footer are included.
  4. All 12 selected tests passed on their first attempts, zero failures, at e43f06da65941b07a84b35b5ed98ae8b10358c06. Separate test-comprehensiveness and code-review passes are in the evidence findings; their findings were fixed and re-verified. Canonical was then rebased to main873257e520eb0e17b254f87b8f7412986df697c4 and pushed at83121a2a3cb5df1553afdc00d3c16800eaebc752. All 34 branch commits compare unchanged. Main added interruption tests and provisioning-budget changes; the selected tests and projection-membership code are unchanged, but the combined head has not passed a full suite.
  5. The preceding canonical Actions run https://github.com/CodexCoder21Organization/BuildTestEmbedded/actions/runs/37307037552 exposed an additional contract conflict: projectionPageInterruptedReadPreservesAdvertisedResetTest strips the seed journal certificate, captures an incomplete reset, then compares it with a new foreign-cursor reset after startup certifies membership. All three attempts fail that equality; the existing old-snapshot byte assertion passes. This is not attributed to a main flake. The lane rule requires a ruling before repairing a wrong expectation. An unapplied and unverified patch holds startup through the original interruption assertions, preserving the legacy case, 2000 rows, four readers and every existing assertion/bound. Recommend approving that ordering repair; alternatively use a certified fixture plus a separate legacy case. The latter needs additional coverage.
  6. Image-change first-attempt duration is confirmed pre-existing on main at https://github.com/CodexCoder21Organization/BuildTestEmbedded/actions/runs/37274634012 and https://github.com/CodexCoder21Organization/BuildTestEmbedded/actions/runs/37279607588; it was not rerun. The old shard3 also had a retry-only interrupted-caller test failure whose mechanism is not established. The legacy uncertified-journal plus publication Error coverage gap remains explicitly recorded as allowed by the review brief.
  7. Plain bounded build-watchman returned PENDING, not green: four Actions shards are running, and required bld-build is not yet reported. It identified the older kotlin-build-ci-test app as inactive across mature main suites and did not rerequest dispatch. No remote suite was submitted in this invocation. No merge, enqueue, deploy, publication, PR closure or handoff completion occurred.

Relevant PRs and refs

All branches below were compared with the current remote listing. No satellite is recommended for closure; retain historical evidence and leave other owners’ PRs untouched.

PR or branch Remote head / PR head State and purpose
https://github.com/CodexCoder21Organization/BuildTestEmbedded/pull/1127 83121a2a3cb5df1553afdc00d3c16800eaebc752 OPEN; 2 FAILURE, 3 SUCCESS
https://github.com/CodexCoder21Organization/BuildTestEmbedded/pull/1198 3a7293e1d73b8a9be56a48d91ec06e8aa84c3042 OPEN; 5 FAILURE
https://github.com/CodexCoder21Organization/BuildTestEmbedded/pull/1216 4974f64b2dade29bde5274d2c27a587c8a743634 OPEN; 3 FAILURE, 2 SUCCESS
https://github.com/CodexCoder21Organization/BuildTestEmbedded/pull/1228 2f89862024bf38c0d2840bbe9b5470007833df39 OPEN; 4 FAILURE, 1 SUCCESS
https://github.com/CodexCoder21Organization/BuildTestEmbedded/pull/1235 4db77d73cd2c9f76fa0e8d0d244e6fd31a9349ae MERGED; 5 SUCCESS
https://github.com/CodexCoder21Organization/BuildTestEmbedded/pull/1240 60e950ae84f627d854f90ec115f918179d5e3c4b MERGED; 5 SUCCESS
https://github.com/CodexCoder21Organization/BuildTestEmbedded/pull/1248 4dd5f2731a4f4fff6a106b39a4ff6cbebc219295 MERGED; 5 SUCCESS
https://github.com/CodexCoder21Organization/BuildTestEmbedded/pull/1249 321ced9e6ab6712585fd563ed5451852c5f6bb9c MERGED; 5 SUCCESS
https://github.com/CodexCoder21Organization/BuildTestEmbedded/pull/1197 4cfe2b2e761125aa7eb4932efa44cf3f09aae525 MERGED; 5 SUCCESS
https://github.com/CodexCoder21Organization/BuildTestEmbedded/pull/1252 e47118fc102e31a6e7bb1d93172f907af93a1548 MERGED; 5 SUCCESS
https://github.com/CodexCoder21Organization/BuildTestEmbedded/pull/1256 7966e6bbcaef840cb7d6eea2e9c4bea7018f8b05 MERGED; 5 SUCCESS
https://github.com/CodexCoder21Organization/BuildTestEmbedded/pull/1251 461fdf0952f5b0c098328a5264c788a20f3dad17 MERGED; 5 SUCCESS
https://github.com/CodexCoder21Organization/BuildTestEmbedded/pull/1258 5fd63f2adbd6eb768181826ccfc94af5e8188b71 MERGED; 5 SUCCESS
https://github.com/CodexCoder21Organization/BuildTestEmbedded/pull/1244 9dc242d84207aa3e53a5aeba198d138e38760acb MERGED; 5 SUCCESS
https://github.com/CodexCoder21Organization/BuildTestEmbedded/tree/wip/L43-eighth-image 1fc33222f73b1ed0e39155d6822e2d317eb19806 Historical proof or partial work; keep for review, do not merge separately.
https://github.com/CodexCoder21Organization/BuildTestEmbedded/tree/wip/L43-eighth-evidence 1a4a650bc5e16159543093f19a82c1b69ca5c5db Historical proof or partial work; keep for review, do not merge separately.
https://github.com/CodexCoder21Organization/BuildTestEmbedded/tree/feat/shared-helper-buildmaven-20261004 2f89862024bf38c0d2840bbe9b5470007833df39 Historical proof or partial work; keep for review, do not merge separately.
https://github.com/CodexCoder21Organization/BuildTestEmbedded/tree/fix/FPCF2-continuous-maintenance-event-gates 4dd5f2731a4f4fff6a106b39a4ff6cbebc219295 Historical proof or partial work; keep for review, do not merge separately.
https://github.com/CodexCoder21Organization/BuildTestEmbedded/tree/fix/L062-membership-integration fbaf47d71e3d2e25cdcf1c1a02f2633baf944f48 Historical proof or partial work; keep for review, do not merge separately.
https://github.com/CodexCoder21Organization/BuildTestEmbedded/tree/fix/L193-membership-followup b9798e4bbea2d53e3200319a00309ef7ac0af3ae Historical proof or partial work; keep for review, do not merge separately.
https://github.com/CodexCoder21Organization/BuildTestEmbedded/tree/fix/L228-projection-lock-scenarios 4974f64b2dade29bde5274d2c27a587c8a743634 Historical proof or partial work; keep for review, do not merge separately.
https://github.com/CodexCoder21Organization/BuildTestEmbedded/tree/fix/L307-membership-legacy-children 683a2412d5b9a1f876d3a78d0de9b65c42a66fc5 Historical proof or partial work; keep for review, do not merge separately.
https://github.com/CodexCoder21Organization/BuildTestEmbedded/tree/fix/maintenance-feed-fixture-ordering-2026-10-04 60e950ae84f627d854f90ec115f918179d5e3c4b Historical proof or partial work; keep for review, do not merge separately.
https://github.com/CodexCoder21Organization/BuildTestEmbedded/tree/fix/projection-repair-missing-child-sources-2026-10-02 3a7293e1d73b8a9be56a48d91ec06e8aa84c3042 Historical proof or partial work; keep for review, do not merge separately.
https://github.com/CodexCoder21Organization/BuildTestEmbedded/tree/wip/L058-membership-triage 9105d3f4044d4d170afc6dff536c72a701e4ff2e Historical proof or partial work; keep for review, do not merge separately.
https://github.com/CodexCoder21Organization/BuildTestEmbedded/tree/wip/L062-membership-evidence 9e8ca352cea7da34fb238d1cd70341986e149379 Historical proof or partial work; keep for review, do not merge separately.
https://github.com/CodexCoder21Organization/BuildTestEmbedded/tree/wip/L062-membership-integration 11b6f781a0151dfb3ccf713a2538519042860c32 Historical proof or partial work; keep for review, do not merge separately.
https://github.com/CodexCoder21Organization/BuildTestEmbedded/tree/wip/L062-membership-original 21688302b79fe4d23f133171be8dbc8d9326aa36 Historical proof or partial work; keep for review, do not merge separately.
https://github.com/CodexCoder21Organization/BuildTestEmbedded/tree/wip/L073-membership-evidence 39bc322a9e1474330629cfe9adea47693ab9d4f9 Historical proof or partial work; keep for review, do not merge separately.
https://github.com/CodexCoder21Organization/BuildTestEmbedded/tree/wip/L073-membership-followup dd93a5de00ccb93ee0e15bb3bc1423c65c68a13e Historical proof or partial work; keep for review, do not merge separately.
https://github.com/CodexCoder21Organization/BuildTestEmbedded/tree/wip/L073-membership-integration b166f11d53f027ba61226f8639e4deb252bb7cdc Historical proof or partial work; keep for review, do not merge separately.
https://github.com/CodexCoder21Organization/BuildTestEmbedded/tree/wip/L081-membership-evidence 52d545d156426ba9bc2963ce1825d20ec3e0f763 Historical proof or partial work; keep for review, do not merge separately.
https://github.com/CodexCoder21Organization/BuildTestEmbedded/tree/wip/L19-source-loss-membership-2026-09-28 8d9f96cfd59630a6f91daf7b4935c5bf724380bf Historical proof or partial work; keep for review, do not merge separately.
https://github.com/CodexCoder21Organization/BuildTestEmbedded/tree/wip/L193-membership-evidence b485678816bd7e90394ec63d2ddf163cc35b1d2f Historical proof or partial work; keep for review, do not merge separately.
https://github.com/CodexCoder21Organization/BuildTestEmbedded/tree/wip/L193-membership-followup b9798e4bbea2d53e3200319a00309ef7ac0af3ae Historical proof or partial work; keep for review, do not merge separately.
https://github.com/CodexCoder21Organization/BuildTestEmbedded/tree/wip/L204-membership-evidence 56e499e6e7836abe2806e348c47fd34e559c0b2c Historical proof or partial work; keep for review, do not merge separately.
https://github.com/CodexCoder21Organization/BuildTestEmbedded/tree/wip/L204-membership-regression-fixes 4a16b70d897400e00a65914f79cea63878f1b22c Historical proof or partial work; keep for review, do not merge separately.
https://github.com/CodexCoder21Organization/BuildTestEmbedded/tree/wip/L216-certified-reset-fixtures 09ff13f69998b4ac3c7f76ec21c4c07cbbee57b3 Historical proof or partial work; keep for review, do not merge separately.
https://github.com/CodexCoder21Organization/BuildTestEmbedded/tree/wip/L216-membership-evidence be5b202b7bc821a84865d92b80c9ae9b5cd12c8f Historical proof or partial work; keep for review, do not merge separately.
https://github.com/CodexCoder21Organization/BuildTestEmbedded/tree/wip/L27-membership-recovery-2026-09-28 2dd20d2e9899852af6aff5983a3c64af2159053d Historical proof or partial work; keep for review, do not merge separately.
https://github.com/CodexCoder21Organization/BuildTestEmbedded/tree/wip/L307-membership-baseline 3d3265baac4482f4f30777b76e6146a756a685a7 Historical proof or partial work; keep for review, do not merge separately.
https://github.com/CodexCoder21Organization/BuildTestEmbedded/tree/wip/L307-membership-evidence ac6c1ac22dfdb67ca467182861223079368d7d23 Historical proof or partial work; keep for review, do not merge separately.
https://github.com/CodexCoder21Organization/BuildTestEmbedded/tree/wip/L307-membership-original 4a16b70d897400e00a65914f79cea63878f1b22c Historical proof or partial work; keep for review, do not merge separately.
https://github.com/CodexCoder21Organization/BuildTestEmbedded/tree/wip/L317-membership-evidence 51ea8b330108317c28c5846fb776e8c1973f0db3 Historical proof or partial work; keep for review, do not merge separately.
https://github.com/CodexCoder21Organization/BuildTestEmbedded/tree/wip/L43-duration-diagnostics 0aa9c25dfde7fa0d60c0f72ea40fe194dd9d52ee Diagnostic experiment only; retain evidence, do not merge as product code.
https://github.com/CodexCoder21Organization/BuildTestEmbedded/tree/wip/L43-membership-certification 8fba48deb5c146d36e1623f0c95b1836117b357d Historical proof or partial work; keep for review, do not merge separately.
https://github.com/CodexCoder21Organization/BuildTestEmbedded/tree/wip/L43-membership-evidence 1770503f69404d81c9162682bac4a0787ced9355 Historical proof or partial work; keep for review, do not merge separately.
https://github.com/CodexCoder21Organization/BuildTestEmbedded/tree/wip/L5-complete-reset-membership-2026-09-28 767c0bd4e4ef8f5827040fbd887f9e219eb58867 Historical proof or partial work; keep for review, do not merge separately.
https://github.com/CodexCoder21Organization/BuildTestEmbedded/tree/wip/bte-membership-2026-10-02 11f4030f461402947610ddeb92b92d3d9431b2da Historical proof or partial work; keep for review, do not merge separately.
https://github.com/CodexCoder21Organization/BuildTestEmbedded/tree/wip/c21-complete-reset-membership-2026-09-28 83121a2a3cb5df1553afdc00d3c16800eaebc752 Current canonical review source; 12 passes before content-preserving rebase; combined-head landing gates pending.
https://github.com/CodexCoder21Organization/BuildTestEmbedded/tree/wip/flaky-maint-2026-10-04 fdc500374c80f6c5aaa4ce78d948859477df8a24 Historical proof or partial work; keep for review, do not merge separately.
https://github.com/CodexCoder21Organization/BuildTestEmbedded/tree/wip/p11-1127-evidence-2026-09-29 1c9c0354485133242cb5c97019f429a92c7e2e6c Historical proof or partial work; keep for review, do not merge separately.
https://github.com/CodexCoder21Organization/BuildTestEmbedded/tree/wip/p11-1127-fix-2026-09-29 270fddae5f025723560374993edfc6402cd5f492 Historical proof or partial work; keep for review, do not merge separately.
https://github.com/CodexCoder21Organization/BuildTestEmbedded/tree/wip/p11-evidence-handoff-2026-09-29 1c9c0354485133242cb5c97019f429a92c7e2e6c Historical proof or partial work; keep for review, do not merge separately.
https://github.com/CodexCoder21Organization/BuildTestEmbedded/tree/wip/p11b-1127-continue-2026-09-29 f5e994cd28c7189c662601c5d100b61c0cab3c86 Historical proof or partial work; keep for review, do not merge separately.
https://github.com/CodexCoder21Organization/BuildTestEmbedded/tree/wip/p11b-1127-evidence-2026-09-29 708d63835059735a457570270ed54ccee0b1852e Historical proof or partial work; keep for review, do not merge separately.
https://github.com/CodexCoder21Organization/BuildTestEmbedded/tree/wip/p11c-1127-main-20260929-handoff-2026-09-29 264b1c2ae0f81746ab086ea198eecde9efa6f831 Historical proof or partial work; keep for review, do not merge separately.
https://github.com/CodexCoder21Organization/BuildTestEmbedded/tree/wip/p11d-2026-09-29b 59b1d1dd35d154e4429bb1e87ec53b342d52e23c Historical proof or partial work; keep for review, do not merge separately.
https://github.com/CodexCoder21Organization/BuildTestEmbedded/tree/wip/p11d-2026-09-29b-rebased d6f1efe188f4281e23712a04164babac9680da98 Historical proof or partial work; keep for review, do not merge separately.
https://github.com/CodexCoder21Organization/BuildTestEmbedded/tree/wip/L43-seventh-baseline-proofs 267a629a3143ef046b1b695acf83e0c049da0d7f Historical proof or partial work; keep for review, do not merge separately.
https://github.com/CodexCoder21Organization/BuildTestEmbedded/tree/wip/L43-seventh-maintenance-fix 3ca406c9b999eb1f599b47926636f97204a2d3f3 Historical proof or partial work; keep for review, do not merge separately.
https://github.com/CodexCoder21Organization/BuildTestEmbedded/tree/wip/L43-seventh-duration-diagnostics 826e5423d4fe2d68975b0dc0a33529528703537d Diagnostic experiment only; retain evidence, do not merge as product code.
https://github.com/CodexCoder21Organization/BuildTestEmbedded/tree/wip/L43-seventh-fixture-setup acbc3a2d4ee6cccfa412422fbe4cc676cf25d0fe Historical proof or partial work; keep for review, do not merge separately.
https://github.com/CodexCoder21Organization/BuildTestEmbedded/tree/wip/L43-seventh-main-integration 5493a78e664ae468383da0f591c439482702556f Historical proof or partial work; keep for review, do not merge separately.
https://github.com/CodexCoder21Organization/BuildTestEmbedded/tree/wip/L43-seventh-rebased-candidate 0ea5d451be446264f71666f2d9c71a1a03cd6c4f Historical proof or partial work; keep for review, do not merge separately.
https://github.com/CodexCoder21Organization/BuildTestEmbedded/tree/wip/L43-ninth-membership a8896f5e5683c9c377b9073b07a1e83d077878df Historical proof or partial work; keep for review, do not merge separately.
https://github.com/CodexCoder21Organization/BuildTestEmbedded/tree/wip/L43-ninth-snapshot-proof d4194fa0f2715df7498860fddb398b1bc757c5ee Historical proof or partial work; keep for review, do not merge separately.
https://github.com/CodexCoder21Organization/BuildTestEmbedded/tree/wip/L43-ninth-fixture-proofs 3b2be6c1d2ba0a4f1f0aa8f67713df018a09f9e9 Historical proof or partial work; keep for review, do not merge separately.
https://github.com/CodexCoder21Organization/BuildTestEmbedded/tree/wip/L43-ninth-evidence f3d39307ba9199ec2232b639e05049c113e201a1 Historical proof or partial work; keep for review, do not merge separately.
https://github.com/CodexCoder21Organization/BuildTestEmbedded/tree/wip/L43-tenth-membership 83121a2a3cb5df1553afdc00d3c16800eaebc752 Current canonical review source; 12 passes before content-preserving rebase; combined-head landing gates pending.
https://github.com/CodexCoder21Organization/BuildTestEmbedded/tree/wip/L43-tenth-evidence d88227f7216dfa97136616e8a61e3163426884c0 All three fail-first proofs, 12 passing proofs, separate reviews, CI evidence and unapplied fixture proposal; evidence only.
https://github.com/CodexCoder21Organization/BuildTestEmbedded/tree/wip/L43-tenth-baseline 1f5d01eac58db91c7664fdeda091f25ab2998e8f Unfixed implementation with three deterministic public failures; do not merge.
https://github.com/CodexCoder21Organization/BuildTestEmbedded/tree/wip/L43-tenth-proofs e43f06da65941b07a84b35b5ed98ae8b10358c06 Exact corrected head with 12 first-attempt passes and 0 failures; preserve.
https://github.com/CodexCoder21Organization/BuildTestEmbedded/tree/wip/L43-eleventh-evidence 0b5aae0d62f45ec2d892f78a734a71d5ddfc2de6 Run-11 CI classifications, main first-attempt traces, rebase series and unapplied second fixture proposal; preserve.
https://github.com/CodexCoder21Organization/BuildTestEmbedded/tree/wip/L43-eleventh-interrupted-ordering a3b3fedc049880d1acdd5e8b99685b132bd9f0e2 Approved fixture ordering on unchanged old production; controlled comparison, not separately mergeable.

Satellite recommendations

Keep the three open satellites with their owners. The missing-source repair at https://github.com/CodexCoder21Organization/BuildTestEmbedded/pull/1198 contains separate restoration and retained-row work. The compiler-scenario split at https://github.com/CodexCoder21Organization/BuildTestEmbedded/pull/1216 is not on current main by content (the new accepted/legacy file is absent there). The CLI adoption at https://github.com/CodexCoder21Organization/BuildTestEmbedded/pull/1228 deliberately has four migration-caused expected-version failures and does not prove a shared-helper speedup; do not absorb it into this membership correction. Keep merged PRs and historical branches as evidence. No closure is recommended.

Latest main indexed-read change: https://github.com/CodexCoder21Organization/BuildTestEmbedded/pull/1340, MERGED at head0279e3ef6aa79c3a544b327302faecee83ea03ec, five successful checks. Current main commit: https://github.com/CodexCoder21Organization/BuildTestEmbedded/commit/0be27701e9c3e236afddd7ec15bd2d080591e6b0.

The final gate for this invocation is CHECKPOINT. The approved old-base fixture repair is proven; current-main runtime gates and the separately proposed fixture repair remain unfinished.

Next steps

  1. Re-verify claim, canonical PR state/head, and current main. Read run11 findings and its CI classification before choosing work. Preserve all evidence; no branch closure is recommended.
  2. Preserve the completed approved fixture proof: first fixed attempt8301ms,1 pass/0 failures; old-head CI first failure7197ms. The fresh local baseline executed zero tests. Re-run this fixture on the final integrated head as one of the13 requested proofs; keep all2000 rows, four readers, assertions and bounds.
  3. Run the existing main zero-prefix-work guard on the diagnostic candidate. Once its exact trace confirms the source mechanism, fix discovery without scanning unrelated rows or losing legacy child state. Derive staged run membership during collection; use captured source-index information for selective discovery without assuming fingerprints cover all legacy rows. Verify both N/10N work guards, the legacy-child replacement test, stalled-create and baseline-row-close neighbors, and all13 selected proofs. resume-tests.txt lists them. Use one selector per jvm-slot acquisition; bound admission by the overall lane deadline and put the unchanged1800-second JVM execution cap inside the slot. Never extend any test-level bound.
  4. Supervisor: rule on the separate publication-wait fixture proposal. Recommended ordering preserves the unchanged legacy scenario and assertions. Apply only once authorized, with the recorded old first failure and fixed first-attempt proof.
  5. After these fixes/proofs, run the exact-head full remote suite, preserving first-attempt counts. Re-check OPEN and duplicate work, fetch/rebase, then update canonical with force-with-lease only after required gates. Never rerun a failed check merely for green; plain build-watchman only.
  6. Supervisor independent reviews, final review and merge remain after required checks are green. Supervisor alone completes the handoff. No deploy or publication is authorized.

Operational knowledge

Source comparison worktree: /code/ws/L43/BuildTestEmbedded-eleventh-code. Final integration worktree: /code/ws/L43/BuildTestEmbedded-eleventh-integration. Evidence worktree: /code/ws/L43/BuildTestEmbedded-eleventh-evidence. The integration source branch is not pushed because its shared-contract full-suite gate is unmet; every source commit is recoverable from the complete replay series on the evidence branch. No source work is stranded only on disk.

All local test processes have exited. Approved comparison proof is1 pass/0 failures. Fresh baseline and both integration commands produced zero test results; no full remote suite was submitted. All13 requested current-main proofs remain unexecuted. The wrapper counted queue time inside its outer budget, so late admission left insufficient preparation time; this was a wrapper-budget limitation, not a failed test or a production root cause. Resume with separately bounded admission and an unchanged1800-second execution cap, still one selector per acquisition and within the lane stop. The public launcher uses maxTestAttempts=1. Keep all existing test bounds/counts/assertions.

Primary findings: /tmp/claude-1000/-code/4127b3f9-6050-446f-a28d-b0511dacd396/scratchpad/hq/out/L43-findings.md. Full CI XML, main first-attempt traces, comparison XML, compressed logs, replay series, source reviews, second fixture proposal and resume selectors are on the evidence branch. The canonical WHY-first PR description was updated; gh pr edit failed on the retired Projects GraphQL field, so the same body was applied with REST PATCH. No PR was closed. Nothing was merged, enqueued, deployed, published or completed in this invocation.

Export PATH=/code/ws/bin:$PATH. Use the provided JVM Coursier wrapper rather than the wrong-architecture global binary. Handoff transport failures and admission-only client timeouts are recorded separately; do not label a client that never started as a service outage. Last successful RUNNING report was the02:03 text uploaded around02:12; final update/report results are recorded in the lane findings.

Required reading and standards used: https://github.com/CodexCoder21Organization/PlanRepository/blob/main/handoffs/README.md#triaging-handoffs, https://github.com/CodexCoder21Organization/DocumentationRepository/blob/main/architecture/TESTING.md, https://github.com/CodexCoder21Organization/DocumentationRepository/blob/main/PHILOSOPHY.md, https://github.com/CodexCoder21Organization/DocumentationRepository/blob/main/CODE_REVIEW.md, plus repository README and the linked state-management, embedded, CQRS and storage architecture documents listed in the findings. Re-verify every snapshot before acting.

Latest status report

16 reports
Running fable-hq-20261004 4127b3f9 3 minutes ago

Status report — 2026-10-09 05:39 UTC (RUNNING)

Original request: "Work through all open handoffs, delegating to codex/gpt for the heavy lifting, skip any handoffs which are already claimed. Make sure you (fable) do the final review before merging. Use your best judgement to decide how to proceed (handoffs and PRs may be obsolete or low quality or whatever) decide if they should be merged or closed or if anything from them can be salvaged. Drive them to completion. Parallelize with 6 workers who grab work off the queue (not waves). The work on one of the 6 parallel handoffs should be driven to completion before another is started."

🟡 Status: RUNNING. Seven handoffs are now claimed by this session (agent fable-hq-20261004): the six BuildTestEmbedded and kompile-buildscript handoffs each on a codex lane (five relaunched this cycle with fresh rulings), plus a seventh, unclaimed until now, that owns the fix for tonight's buildtest outage. Two Opus lanes are on the handoff-service fix and the outage fix. Nothing on the path to DONE depends on the user. The three deploy recommendations at the end are for your decision only.

Progress since the 05:04 report (the 05:31 cycle ran late because of the disk incident below)

  • Root cause of the buildtest outage, established read-only. The forensic lane finished: the resolver library that connects the buildtest coordinator to the droplet service has a 30 s per-call limit, and when one call exceeds it, the library shuts down the whole shared connection, so every other run's in-flight create or status call, and every object already returned over that connection, dies with "closed instance proxy". The droplet service's SSH-key grant legitimately blocks up to 5 minutes, so one slow-booting droplet kills every other run's provisioning. The coordinator log holds 559 such shutdowns since 16:02 yesterday, 84 percent triggered by the SSH grant. A separate, now-cleared trigger (the droplet service's timer requests to the WebCron scheduler exceeding 20 s) stopped all creation between 04:10 and 05:20. A restart would not help: the coordinator already reopens the connection, and the next slow grant brings the failure back. Two existing PRs by the other active orchestrator address exactly this: https://github.com/CodexCoder21Organization/UrlResolver/pull/1226 (make a deadline fail only its own call) and https://github.com/CodexCoder21Organization/DigitalOceanDropletServiceServer/pull/144 (make the SSH grant asynchronous), both with red CI and untouched for 13 hours and 3 days respectively. Their handoff was unclaimed, so I claimed it and dispatched lane PROV2 (Opus) to prove the mechanism with a fail-first test on main versus that PR's head, classify its 7 failing tests, and prepare any needed fixes on my own branch with a comment on the PR, never pushing to the other orchestrator's branches. Challenge records filed and merged: https://github.com/CodexCoder21Organization/PlanRepository/blob/main/challenges/2026-10-09-0521-buildtest-droplet-provisioning-broken-since-about-00-50.md (a duplicate with suffix -2 also landed because my first filing attempt raced the text file; harmless).
  • The buildtest web API is stale (it reports itself out of date; its run list ends at 01:55), so the "nothing completed since 00:12" picture was partly the stale view: the coordinator log shows two runs completed after 01:49. Still, provisioning is failing for most new runs and no PR has had a required check run end-to-end since.
  • The box's disk hit 100% at 05:20 (2.3 GB free of 309 GB), caught by lane L43's failing selector and confirmed. I deleted the checkouts and build caches of lanes that finished on 2026-10-05 and the dependency clones of finished review lanes: 37 GB free now (89%). All new briefs forbid fresh full clones. Lane L40's one storage failure (archive admission needed 5.37 GB free and saw 4.6 GB) was this incident; it had responded by adding storage margins to 16 test fixtures, which I ruled out as calibrating tests to the machine and instructed it to revert.
  • Five lanes hit their 2.5 h boxes and were relaunched with rulings: L28 (mechanism proven: an interrupted projection reader re-waits on the journal lock the publisher holds, so the interruption is lost; run 5 implements the interruptible-acquisition fix), L49 (two fixture rulings: use the public writable error-message field instead of the read-only label, and select outside the protected tail only with an identity assertion), L43 (fixtures proven both ways, 14 selectors left), L44 (24 assertions preserved, unrepaired watchdog fails 3 of 3, candidate 3 first-attempt passes, four inherited gates left), and L40 (compile proven, storage-margin patch reverted, 17 focused selectors to run with native snapshots). L47 continues toward its 06:16 box.
  • Handoff-service fix https://github.com/CodexCoder21Organization/HandoffServiceServer/pull/30: the implementing lane HSVC3 checkpointed at its box with the code complete; the re-review had closed every code item; follow-on lane HSVC4 pushed the final two nits as head 332604dd at 05:20 and is running the marshaling, proxy, storm and four neighbour tests on that exact head (it correctly noticed the neighbours must be re-run because production source changed since the last neighbour pass), plus the final storm test against both old heads. CI for this head has not dispatched (no check-run exists yet); its watcher will catch the lost dispatch. Enqueue waits on provisioning either way.
  • Merge queues: https://github.com/CodexCoder21Organization/UrlProtocol/pull/647 position 4, https://github.com/CodexCoder21Organization/UrlResolver/pull/1169 position 16; both queue runs will fail on provisioning if they reach the head before the fix lands. https://github.com/CodexCoder21Organization/UrlProtocol/pull/649's second re-requested check failed on the provisioning stall; no further retries.
  • Handoff mirror: the 05:04 report reached all six handoffs; this one goes to seven.

PRs from this session (live-verified 05:37 UTC)

✅ Merged

  • https://github.com/CodexCoder21Organization/BuildTestEmbedded/pull/1197 (2026-10-05 11:35), https://github.com/CodexCoder21Organization/BuildTestEmbedded/pull/1236 (10-04 20:50), https://github.com/CodexCoder21Organization/BuildTestEmbedded/pull/1239 (10-05 02:18), https://github.com/CodexCoder21Organization/BuildTestEmbedded/pull/1244 (10-05 14:05), https://github.com/CodexCoder21Organization/BuildTestEmbedded/pull/1248 (10-05 06:52), https://github.com/CodexCoder21Organization/BuildTestEmbedded/pull/1258 (10-05 13:40), https://github.com/CodexCoder21Organization/BuildTestWui/pull/362 (10-05 12:16), https://github.com/CodexCoder21Organization/PlanRepository/pull/10909 and https://github.com/CodexCoder21Organization/PlanRepository/pull/10910 (challenge records, 05:3x).

⏳ Pending

  • https://github.com/CodexCoder21Organization/HandoffServiceServer/pull/30 — OPEN, head 332604dd; code reviewed clean twice; local re-runs on the final head in progress; required check not yet dispatched; blocked on provisioning.
  • https://github.com/CodexCoder21Organization/UrlProtocol/pull/647 — OPEN, final review clean; merge queue position 4.
  • https://github.com/CodexCoder21Organization/UrlResolver/pull/1169 — OPEN, final review clean; merge queue position 16.
  • https://github.com/CodexCoder21Organization/UrlProtocol/pull/649 — OPEN, final review clean; remote check failed twice on infrastructure; waits for provisioning.
  • https://github.com/CodexCoder21Organization/kompile-buildscript/pull/87 — OPEN draft; L47 producing the candidate head.
  • https://github.com/CodexCoder21Organization/BuildTestEmbedded/pull/1127 (L43), https://github.com/CodexCoder21Organization/BuildTestEmbedded/pull/1130 (L44), https://github.com/CodexCoder21Organization/BuildTestEmbedded/pull/1207 (L49), https://github.com/CodexCoder21Organization/BuildTestEmbedded/pull/1213 (L40) — OPEN, need rebase, lanes relaunched.
  • https://github.com/CodexCoder21Organization/UrlResolver/pull/1185 — OPEN; waits on protocol 0.0.605 from https://github.com/CodexCoder21Organization/UrlProtocol/pull/637 (other orchestrator).
  • Not mine, under verification by PROV2: https://github.com/CodexCoder21Organization/UrlResolver/pull/1226 (OPEN, remote check 1885 passed / 7 failed, build failing) and https://github.com/CodexCoder21Organization/DigitalOceanDropletServiceServer/pull/144 (OPEN, all-tests failing).

Delegated work at a glance

⏳ Running - GPT 6.1-sol high - 1 hour 52 minutes total time - 5 minutes since last update - Lane L47 run 6 on https://github.com/CodexCoder21Organization/kompile-buildscript/pull/87. Repaired fixture executing under the original bound; diagnostic and negative variants queued; no behavior repair applied yet. Next checkpoint: the verdicts, or CHECKPOINT at 06:16.

⏳ Running - GPT 6.1-sol high - 15 minutes total time - launching/claiming - Lane L28 run 5: finish three current-main bodies, implement the interruptible-acquisition fix at the one blocking primitive, flip the bodies, open the WHY-first PR. Next checkpoint: the mechanism statement and third-body results.

⏳ Running - GPT 6.1-sol high - 15 minutes total time - launching/claiming - Lane L49 run C on https://github.com/CodexCoder21Organization/BuildTestEmbedded/pull/1207 with both fixture rulings. Next checkpoint: both fixtures proven three ways.

⏳ Running - GPT 6-astra high - 5 minutes total time - launching/claiming - Lane L43 run 13 on https://github.com/CodexCoder21Organization/BuildTestEmbedded/pull/1127: re-run the disk-failed selector post-restoration, then the 14 remaining selectors. Next checkpoint: first selector results.

⏳ Running - GPT 6-astra high - 5 minutes total time - launching/claiming - Lane L44 run 12 on https://github.com/CodexCoder21Organization/BuildTestEmbedded/pull/1130: re-claim, four remaining inherited gates, two saved public experiments. Next checkpoint: the four gate results.

⏳ Running - GPT 6.1-sol high - 2 minutes total time - launching - Lane L40 run 13 on https://github.com/CodexCoder21Organization/BuildTestEmbedded/pull/1213: revert the storage-margin patch, run 17 focused selectors with native snapshots. Next checkpoint: the first held-scenario diagnostic.

⏳ Running - Opus medium - 23 minutes total time - 5 minutes since last update - Agent lane HSVC4 on https://github.com/CodexCoder21Organization/HandoffServiceServer/pull/30: nit head pushed; marshaling, proxy, storm, four neighbours and the two old-head storm runs queued on JVM slots. Next checkpoint: first-attempt verdicts and the filled results table.

⏳ Running - Opus medium - 3 minutes total time - just launched - Agent lane PROV2 on the buildtest outage fix: fail-first test for the connection-shutdown mechanism on main versus https://github.com/CodexCoder21Organization/UrlResolver/pull/1226, classification of its 7 failing tests, fixes on my own branch, one factual comment on the PR. Next checkpoint: the fail-first verdicts.

⚪ Not running (finished) - Opus medium - 10 minutes total time - 11 minutes since last update - Agent lane BTPROV1 read-only forensic: GATE ROOT_CAUSE with the mechanism, evidence, blast radius, existing PRs and the recommendation above. Nothing further expected.

⚪ Not running (finished) - Opus medium - 2 hours 32 minutes total time - 13 minutes since last update - Agent lane HSVC3: implemented and proved the handoff-service fix, closed every review finding, checkpointed; resume steps owned by HSVC4. Nothing further expected.

⚪ Not running (finished) - GPT 6 lanes L28 run 4, L49 run B, L43 run 12, L44 run 11, L40 run 12 - each ended at its 2.5 h box as CHECKPOINT or NEEDS_USER with the evidence summarized above; each replaced by the run listed above. Nothing further expected from these invocations.

Changes since last report: five codex lanes checkpointed and relaunched with rulings; BTPROV1 finished with a root cause; PROV2 launched on a newly claimed seventh handoff; the disk was pruned.

How the fixes work

Handoff service: The service crashed in a loop because each client connection asked for its bytecode and the handler base64-encoded a 2 MB jar plus a 0.7 MB stdlib jar fresh every time, about 10 MB of garbage per request in a 128 MB heap, while a slow consumer left several replies queued unsent. The fix drops the base64 path entirely: the protocol answers the bytecode request itself with a small header plus the jar as one binary attachment that is the same array for every reply, so sixteen queued replies hold one copy and fit both the heap and the outbox ceiling. The deciding test launches the real server entry point in a child JVM with production heap flags, seeds 20 MB of handoff bodies, and has 16 raw wire clients hold their replies unread until the server has answered all of them; it fails on the old code and on encode-once, and passes on streamed.

Buildtest provisioning (PROV2, verifying another orchestrator's PR): One slow call on the coordinator's shared connection to the droplet service makes the resolver library shut the whole connection down, killing every other run's provisioning. The fix makes a per-call deadline fail only its own call and keep the connection and previously returned objects usable, with a second PR making the slow SSH-key grant asynchronous so the deadline is rarely hit at all. The fail-first test holds a returned object in one thread while another thread's call blocks past the limit, then reads the held object: it must return the value, not "closed instance proxy".

Interrupted projection readers (L28): An interrupted snapshot reader re-waits on the journal lock the publisher holds, so the interruption is lost and the reader blocks instead of returning the advertised reset with its cause. The fix makes the reader's lock acquisition interruptible at that one blocking primitive and carries the original cause into the recovery log. Two first-attempt failures on unchanged main are the before-evidence; the same bodies must pass after, and a variant without the interruptible acquisition must fail again.

Blockers

🟡 None requiring the user; one production outage is throttling the pipeline and its fix is now being driven (PROV2). I will not restart production services; the forensic result says a restart would not help anyway. Standing deploy recommendations, your decision only: (1) deploy kotlin-build-ci 0.0.109; (2) deploy the buildtest coordinator after https://github.com/CodexCoder21Organization/BuildTestEmbedded/pull/1213 lands, and after the resolver fix from https://github.com/CodexCoder21Organization/UrlResolver/pull/1226 is pinned; (3) deploy the handoff service once https://github.com/CodexCoder21Organization/HandoffServiceServer/pull/30 lands and 0.0.28 is published.

Plan changes and self-check

Plan changes: a seventh handoff (the outage fix) was pulled onto an Opus lane because it is the artifact every other PR's required check waits on; remote-suite steps are gated on observed provisioning recovery; fresh full clones are forbidden. Progress is real: a root cause with source-level evidence, five lanes advanced to their next proofs, the handoff-service fix at its last gates. Landing parallelization sweep: on https://github.com/CodexCoder21Organization/HandoffServiceServer/pull/30 all gates but CI are done and CI waits on provisioning; the queued PRs have only their runs left; the outage fix's own gates (fail-first proof, classification) started this cycle. No idle runnable gate.

Next steps: prove and land the resolver fix so CI provisions again, then land the handoff-service fix and publish 0.0.28, watch the queued PRs through, drive the six codex lanes to READY_FOR_REVIEW, review and enqueue each green head, complete each handoff, then pull the next unclaimed handoffs onto free slots.

Top-three lessons learned

  1. When every PR's CI goes red at once, investigate the shared service before touching any PR. Three "distinct" infrastructure failures on one PR and a dead-looking pool turned out to be one mechanism in a shared library; a read-only forensic lane found it in ten minutes from the coordinator's logs and the library source, and found the fix already written in an unclaimed handoff. Retrying checks would have burned the day.
  2. Watch the disk as a shared resource of the lane pool, not per lane. Six lanes each cloning repositories and filling build caches took the box from 91% to 100% in five hours, broke a selector, and tempted a lane into "fixing" fixtures for a full host; check free space every cycle and delete finished lanes' checkouts and caches together.
  3. Reproduce the condition in the dump, not the traffic you imagine. A heap dump showing replies queued unsent names a slow consumer as the trigger; fast loopback clients can never create that state, so a storm test built from them passes on broken code. Read the dump for the condition and force it deterministically; that test rejected a fix that had passed every softer test.

Earlier reports

Running fable-hq-20261004 4127b3f9 12 minutes ago
Running fable-hq-20261004 4127b3f9 17 minutes ago
Running fable-hq-20261004 4127b3f9 38 minutes ago
Running fable-hq-20261004 4127b3f9 41 minutes ago
Show all 15 earlier reports

Add dependency

Complete this handoff

Moves it out of every priority list and into ArchiveArea.