← Priority list
In progress

Finish exact-head validation and green the receipt recovery PR

Finish latest-main focused/full gates, then supervisor review and merge of the receipt PR; old shard1 is classified on main, current remote head remains red, source and evidence are checkpointed.

Claimed by fable-hq-20261004

Handoff document

Markdown

Finish exact-head validation and green the receipt recovery PR

RE-VERIFY: Snapshot 2026-10-09T02:42:49.716986+00:00. Re-read live PR/main state before continuing. No merge, enqueue, production deploy, Maven publication or handoff completion is authorized to this lane. This record supersedes historical next-step instructions, while retaining their evidence and source links.

Mission

Complete the receipt-backed coordinator queue recovery change for https://github.com/CodexCoder21Organization/BuildTestEmbedded/pull/1213, verify it on current main, and return it with every required check green for supervisor review. Production runs48dc7b52 and50a16415 on2026-10-05 lost10/10 shards after an ambiguous queue append reported “SSH session is not connected”. A committed append whose reply was lost must retain its healthy owners without adding duplicate work; a confirmed failure must retain its initiating error across restart.

Chain of findings

  1. Preserve the existing receipt/generation implementation and the independently reproduced all-original-worker replacement fix. Do not substitute the older exact-line reconciliation branch. The source and prior fail-first evidence remain in the refs below.
  2. Run11 classified every old shard1 failure on remote head7b5b946eaec028d2f489d28aba409a9bfc100d06. In https://github.com/CodexCoder21Organization/BuildTestEmbedded/actions/runs/37332372896, final failed test testStoredResultLegacyRecoveryRejectsHugeRows failed its full ordinary-size-error assertion on all attempts. The same first-attempt failure appears on base main eebcd85ae3b1e1c635e87eb44c3956f867ccd102 in https://github.com/CodexCoder21Organization/BuildTestEmbedded/actions/runs/37329851092. Current main includes the bounded-read correction in https://github.com/CodexCoder21Organization/BuildTestEmbedded/pull/1267, commit https://github.com/CodexCoder21Organization/BuildTestEmbedded/commit/1032709517f0117845155af6f26546e14a39db96; test first PASS4.230s on main c91873d in https://github.com/CodexCoder21Organization/BuildTestEmbedded/actions/runs/37858390400. bld-build failed only because shard1 failed; compile steps passed.
  3. The same old shard also has first-attempt testMixedReleaseModuleCacheByteBoundEvictsAcrossReleases TIMEOUT122.323s followed by an automatic pass. Base main first attempt TIMEOUT122.380s and current main first attempt TIMEOUT122.191s have the same TailingInputStream.awaitNextPoll frame. This is a pre-existing main flake, not fixed by later automatic passes. No CI check was manually rerun.
  4. Rebased receipt source onto c91873d as e382a966d70ec4a523482055b6f6447a63ddf0b8. Two conflicts preserved both the original queue error and current-main close classification, plus the upload fixture's exact resumed-write assertions and main's completed backfill/storage inputs. Production source compiled successfully. Nine focused FIRST executions on e382/c918: six PASS, three original30-second process-bound results, eight UNEXECUTED. Full committed script bodies were used through literal public entry points, real SSH/server/runner dependencies, with no reflection, test relaxation or artificial load.
  5. Two healthy-owner process-bound logs locate active real runner preparation/class loading and stream polling. They do not identify a mechanism or prove a pre-existing preparation failure. The queue-cause process also recorded124, but its log reaches the complete public terminal/result/projection/restart assertions and the “Verified terminal all-owner failure” marker; process cleanup completion remains unproved. These timeouts did NOT cause old shard1 red. Under the supervisor's run11 scope, unknown healthy-owner preparation and prior upload timeout remain documented follow-ups; do not claim them fixed or add a guessed patch. The Oct8 comparison/control evidence remains valuable and is retained, including six no-loss controls near28–29seconds; these do not establish a pre-existing timeout.
  6. Main advanced to09770c9c1e1052fef76c80bedb506fa087c450c8, merged https://github.com/CodexCoder21Organization/BuildTestEmbedded/pull/1340. New source rebase d4cccf9af4bcf150cce6ab884cfe292b734bfd64 completed without conflict; srcTree8994b6fc8acbace2d9f6a65213480e08feeb5350. New source compilation PASS on exact d4/main097, SHA256f834d0c9f8a1657d0443baecb2675b2b742e8e407c92c6ed4eaa5bd3c81859cc. The bounded current-head controller ended02:37UTC with0test executions/8UNEXECUTED; all eight still require first execution. Earlier e382 results remain separate; focused/full gates are incomplete. Earlier e382 results cannot validate d4. A single-branch clone's git fetch origin main only refreshed FETCH_HEAD; helpers now explicitly fetch main:refs/remotes/origin/main before rebasing.
  7. Source/test-comprehensiveness and adversarial implementation passes were written separately in findings. No production edit beyond the rebase was selected. No receipt source was force-pushed before the required exact-head full-suite gate. Remote PR remains old7b5/red/conflicting. No manual remote suite has yet been submitted in run11; at most one is allowed.
  8. Live handoff get/claim/report calls repeatedly returned ambiguous transport/channel errors or all0peers; no other live claimant was observed. GitHub mirror was read as the newest available record, not silently called a successful live service read. Full reports and this replacement body are on the evidence branch if service update fails.

Current-main caution: the first post-merge CI on09770c9, https://github.com/CodexCoder21Organization/BuildTestEmbedded/actions/runs/37869118984, also has shard4 FAILURE (983/984 final success): analyzeArchiveDoesNotRetainEveryBuildFile reached its unchanged30000ms bound at _JetLexer.advance. Its full XML/log/dump is saved. The same main run has first-attempt testProjectionCrashBeforeSourceCommitKeepsPriorPrefix assertion Expected8/actual6 (2358ms) and testMixedReleaseModuleCacheByteBoundEvictsAcrossReleases TIMEOUT122455ms, both followed by automatic passes. All three full first-attempt histories/stacks are saved. These failures predate any receipt source push; main has both earlier green checks and this failed post-merge run. Do not describe current main as unconditionally green or call this fixed.

Final rebase at02:39UTC: main advanced further to0be27701e9c3e236afddd7ec15bd2d080591e6b0, including archive project attribution https://github.com/CodexCoder21Organization/BuildTestEmbedded/pull/1327, duration filtering https://github.com/CodexCoder21Organization/BuildTestEmbedded/pull/1317, memory-blockage logging https://github.com/CodexCoder21Organization/BuildTestEmbedded/pull/1333 and backward-clock completion https://github.com/CodexCoder21Organization/BuildTestEmbedded/pull/1329. New local source84aeb797df047cec489cc59271cfe9b7936a904a/srcTreeae865f89d83d8c0aad7a692c442abb57c1e9fff4 rebased without conflict; compilation/tests are UNEXECUTED for84a. Keep d4 compilation and e382 test results as historical identity-specific proof. Exact latest source bundle source-84aeb797.bundle is privately saved/roundtrip SHA25686e02ecf75e93c731d61ab6dc8ba41640424aef543068ecea927fe6f893744a2, asset623684204/main0be prerequisite; manifest current-main/latest-bundle-draft-asset.json. No source branch force push before full gate. Live claims now confirms only fable-hq-20261004/live=true; fresh get timed out60seconds, and that limitation remains explicit.

Relevant PRs / refs

Repository/ref Remote head Write-time state
https://github.com/CodexCoder21Organization/BuildTestEmbedded/pull/1197 4cfe2b2e761125aa7eb4932efa44cf3f09aae525 MERGED; bld-test-shard (1 of 4) SUCCESS, bld-test-shard (2 of 4) SUCCESS, bld-test-shard (3 of 4) SUCCESS, bld-test-shard (4 of 4) SUCCESS, bld-build SUCCESS
https://github.com/CodexCoder21Organization/BuildTestEmbedded/pull/1213 7b5b946eaec028d2f489d28aba409a9bfc100d06 OPEN; bld-test-shard (1 of 4) FAILURE, bld-test-shard (2 of 4) SUCCESS, bld-test-shard (3 of 4) SUCCESS, bld-test-shard (4 of 4) SUCCESS, bld-build FAILURE
https://github.com/CodexCoder21Organization/BuildTestEmbedded/pull/1217 f31d551c3ffd72ff0885a1bcc61111da430daea3 OPEN; bld-test-shard (1 of 4) SUCCESS, bld-test-shard (2 of 4) SUCCESS, bld-test-shard (3 of 4) SUCCESS, bld-test-shard (4 of 4) SUCCESS, bld-build SUCCESS
https://github.com/CodexCoder21Organization/BuildTestEmbedded/pull/1221 0935adda4a72a8e6a13a20aa8ceeb787627540ba OPEN; bld-test-shard (1 of 4) SUCCESS, bld-test-shard (2 of 4) FAILURE, bld-test-shard (3 of 4) SUCCESS, bld-test-shard (4 of 4) SUCCESS, bld-build FAILURE
https://github.com/CodexCoder21Organization/BuildTestEmbedded/pull/1235 4db77d73cd2c9f76fa0e8d0d244e6fd31a9349ae MERGED; bld-test-shard (1 of 4) SUCCESS, bld-test-shard (2 of 4) SUCCESS, bld-test-shard (3 of 4) SUCCESS, bld-test-shard (4 of 4) SUCCESS, bld-build SUCCESS
https://github.com/CodexCoder21Organization/BuildTestEmbedded/pull/1239 4fbb612adb726758caae6d700060c45bf52884a8 MERGED; bld-test-shard (1 of 4) SUCCESS, bld-test-shard (2 of 4) SUCCESS, bld-test-shard (3 of 4) SUCCESS, bld-test-shard (4 of 4) SUCCESS, bld-build SUCCESS
https://github.com/CodexCoder21Organization/BuildTestEmbedded/pull/1260 76f7efd0c836d143b8f47136242633cf8b266ddb MERGED; bld-test-shard (1 of 4) SUCCESS, bld-test-shard (2 of 4) SUCCESS, bld-test-shard (3 of 4) SUCCESS, bld-test-shard (4 of 4) SUCCESS, bld-build SUCCESS
https://github.com/CodexCoder21Organization/BuildTestEmbedded/tree/fix/l052-reconnect-publication-ownership 4cfe2b2e761125aa7eb4932efa44cf3f09aae525 Historical source/evidence; retain; salvage remains documented in prior records
https://github.com/CodexCoder21Organization/BuildTestEmbedded/tree/fix/receipt-backed-queue-recovery 7b5b946eaec028d2f489d28aba409a9bfc100d06 Receipt PR remote source unchanged/red; local d4 source is separately checkpointed, not this ref
https://github.com/CodexCoder21Organization/BuildTestEmbedded/tree/fix/requeue-publishes-its-reason-with-the-queue-entry 0935adda4a72a8e6a13a20aa8ceeb787627540ba Historical source/evidence; retain; salvage remains documented in prior records
https://github.com/CodexCoder21Organization/BuildTestEmbedded/tree/fix/ssh-stream-transport-isolation f31d551c3ffd72ff0885a1bcc61111da430daea3 Historical source/evidence; retain; salvage remains documented in prior records
https://github.com/CodexCoder21Organization/BuildTestEmbedded/tree/main 0be27701e9c3e236afddd7ec15bd2d080591e6b0 Latest main; prior097 CI failure is historical proof, newest checks must be re-verified
https://github.com/CodexCoder21Organization/BuildTestEmbedded/tree/test/deterministic-runner-policy-storage 4db77d73cd2c9f76fa0e8d0d244e6fd31a9349ae Historical source/evidence; retain; salvage remains documented in prior records
https://github.com/CodexCoder21Organization/BuildTestEmbedded/tree/wip/L217-single-restart-cause 46c1446b65863a2d97a1d31fd384fc63a5f8e35a Historical source/evidence; retain; salvage remains documented in prior records
https://github.com/CodexCoder21Organization/BuildTestEmbedded/tree/wip/L40-eighth-evidence f1354b56feb11d3cb036f21fdc65889b70730093 Historical source/evidence; retain; salvage remains documented in prior records
https://github.com/CodexCoder21Organization/BuildTestEmbedded/tree/wip/L40-eighth-fixture-inputs bdd0a4e9a781f67c70e1d2fd16c8fb737413895b Historical source/evidence; retain; salvage remains documented in prior records
https://github.com/CodexCoder21Organization/BuildTestEmbedded/tree/wip/L40-fifth-evidence 1d2bca1cb69a7360d1b47dad83ec9350ed7a8412 Historical source/evidence; retain; salvage remains documented in prior records
https://github.com/CodexCoder21Organization/BuildTestEmbedded/tree/wip/L40-ninth-evidence 36e029e28757d62f3fa70ffaeda9f6da2ebe6ed4 Historical source/evidence; retain; salvage remains documented in prior records
https://github.com/CodexCoder21Organization/BuildTestEmbedded/tree/wip/L40-ninth-rebased-source f1716c654133e81652d1e2649457f030a038f0ae Historical source/evidence; retain; salvage remains documented in prior records
https://github.com/CodexCoder21Organization/BuildTestEmbedded/tree/wip/L40-queue-triage f38683fb29a9d40a5d53cd43be087d421b119c33 Historical source/evidence; retain; salvage remains documented in prior records
https://github.com/CodexCoder21Organization/BuildTestEmbedded/tree/wip/L40-receipt-pr-update e525e108ff7f03f2499a649b205adef4599de868 Historical source/evidence; retain; salvage remains documented in prior records
https://github.com/CodexCoder21Organization/BuildTestEmbedded/tree/wip/L40-receipt-review 977ef06b0359a5726d4063fd785340bc95e639e0 Historical source/evidence; retain; salvage remains documented in prior records
https://github.com/CodexCoder21Organization/BuildTestEmbedded/tree/wip/L40-resume-diagnostic ec684398b73bf99248b5a24caa043c1fa960ba0a Historical source/evidence; retain; salvage remains documented in prior records
https://github.com/CodexCoder21Organization/BuildTestEmbedded/tree/wip/L40-resume5-current df24d6038208c0a443b9865daaa97a81426d711e Historical source/evidence; retain; salvage remains documented in prior records
https://github.com/CodexCoder21Organization/BuildTestEmbedded/tree/wip/L40-seventh-evidence 19fa8c472ac9f6fffcae6ea71b0d8f698d9c0d14 Historical source/evidence; retain; salvage remains documented in prior records
https://github.com/CodexCoder21Organization/BuildTestEmbedded/tree/wip/L40-seventh-rebased-source cf3d9b54408d036fbe43c2680d1961555da78839 Historical source/evidence; retain; salvage remains documented in prior records
https://github.com/CodexCoder21Organization/BuildTestEmbedded/tree/wip/L40-sixth-evidence a4ddc90f6b71edcfd89e8cf072829daa4a7f0dfc Historical source/evidence; retain; salvage remains documented in prior records
https://github.com/CodexCoder21Organization/BuildTestEmbedded/tree/wip/L40-stream-current a64ca0b86bdd3f0307a3253d9ccf611b4f44efa5 Historical source/evidence; retain; salvage remains documented in prior records
https://github.com/CodexCoder21Organization/BuildTestEmbedded/tree/wip/L40-tenth-evidence b0f7944dcc69fdf1ec3852c065f145a1ec23e7cb Historical source/evidence; retain; salvage remains documented in prior records
https://github.com/CodexCoder21Organization/BuildTestEmbedded/tree/wip/L40-worker-ownership c9e7536c0b36a2c300b24abd7819aa1ac86df154 Historical source/evidence; retain; salvage remains documented in prior records
https://github.com/CodexCoder21Organization/BuildTestEmbedded/tree/wip/bte-ssh-ambiguous-2026-10-02 fbb090a5451761274c0f723b253cbe65ad0a2582 Historical source/evidence; retain; salvage remains documented in prior records
https://github.com/CodexCoder21Organization/BuildTestEmbedded/tree/wip/fix1238d-2026-10-04 3bff5b871ed54198b5c7df4a4c58a5b1ece8958f Historical source/evidence; retain; salvage remains documented in prior records
https://github.com/CodexCoder21Organization/BuildTestEmbedded/tree/wip/flaky-bte2-2026-10-04 dbb61c04c3417035a16d8c83a131123757599487 Historical source/evidence; retain; salvage remains documented in prior records
https://github.com/CodexCoder21Organization/BuildTestEmbedded/tree/wip/flaky-maint-2026-10-04 fdc500374c80f6c5aaa4ce78d948859477df8a24 Historical source/evidence; retain; salvage remains documented in prior records
https://github.com/CodexCoder21Organization/BuildTestEmbedded/tree/wip/l198-receipt-backed-queue fa1174b427206b2b61ca4e3f2bbc452c4d3eb883 Historical source/evidence; retain; salvage remains documented in prior records
https://github.com/CodexCoder21Organization/BuildTestEmbedded/tree/wip/l208-queue-fixture-baseline 2f4e6f580f77578cdf02c6ed1fb3e583e5e9f615 Historical source/evidence; retain; salvage remains documented in prior records
https://github.com/CodexCoder21Organization/BuildTestEmbedded/tree/wip/sweep-w4-evidence-20261008 751da26d08ac7f66e18e1b1c702343afb19ddf3c Historical source/evidence; retain; salvage remains documented in prior records
https://github.com/CodexCoder21Organization/BuildTestEmbedded/tree/wip/sweep-w4-receipt-rebase-20261008 a5893addaa6f382ceb2425ff5eb4c41ad60bccca Historical source/evidence; retain; salvage remains documented in prior records
https://github.com/CodexCoder21Organization/BuildTestEmbedded/tree/wip/sweep-w4-receipt-round3-20261008 560aa3e37f50cf870307096772b161723a80aaf7 Historical source/evidence; retain; salvage remains documented in prior records
https://github.com/CodexCoder21Organization/BuildTestEmbedded/tree/wip/sweep-w4-receipt-round4-20261008 560aa3e37f50cf870307096772b161723a80aaf7 Historical source/evidence; retain; salvage remains documented in prior records
https://github.com/CodexCoder21Organization/BuildTestEmbedded/tree/wip/sweep-w4-round3-evidence-20261008 255cedbe5836f9850b0d647f420cf08d42ee1547 Historical source/evidence; retain; salvage remains documented in prior records
https://github.com/CodexCoder21Organization/BuildTestEmbedded/tree/wip/sweep-w4-round4-evidence-20261008 341b39a1e427245a0cebfd8afc92ccf4c2620bc6 Historical source/evidence; retain; salvage remains documented in prior records
https://github.com/CodexCoder21Organization/BuildTestEmbedded/tree/wip/L40-eleventh-evidence 1f780e67116c9b9a1dd5015b612b7490a1820382 Run11 CI first-attempt evidence, exact source patches, reviews, dependency hashes and resume helpers; evidence only, never land

Private unpublished artifact checkpoint: https://github.com/CodexCoder21Organization/BuildTestEmbedded/releases/tag/untagged-0e0295340c7f10d2919f, id407393701/tagcheckpoint-L40-e382a966-20261009. Keep unpublished. Source d4 is preserved as authenticated source-d4cccf9a.bundle (main09770c9 prerequisite), plus new source-d4cccf9a.jar (verified manifest in current-main/source-draft-asset.json), e382 bundle/source.jar and nine compiled e382 selectors; exact SHA256/asset IDs in additional-draft-assets.json and draft-artifact-manifest.json. Build outputs are deliberately omitted from git. Source bundles and complete patches preserve the unpushed source while the pre-push full-suite gate remains unmet.

Next steps

  1. Restore the evidence branch and exact source bundle into a fresh workspace clone. Read newest gate/logs first. Verify PR OPEN/head and overlapping open PRs. Explicitly fetch main tracking ref and rebase; a moved source invalidates prior compile/test hashes.
  2. Reuse the verified latest-main compilation if its identity is still current, and finish remaining first-execution focused proofs one jvm-slot admission per selector. Preserve all existing first-attempt failures and full logs; do not rerun a failed test to obtain a pass. Resolve any newly demonstrated PR-caused defect at its source with a deterministic fail-first proof. The old healthy-owner/upload preparation cause remains a separately documented follow-up unless the supervisor widens scope or new failing required checks make it relevant.
  3. Run one exact-head remote full suite only when needed/admitted. Record counts and run ID. No source push before that shared-contract gate. Recheck OPEN/overlap, explicit fetch/rebase immediately before push; force-with-lease only this receipt PR. Keep its reason-first production recurrence and main-first-attempt classification evidence.
  4. Monitor only required checks via tracked bounded build-watchman plain mode. Required ruleset12971715 context is bld-build, aggregating four Actions shards; no separate remote-named context presently exists. Every required check must be green on the final remote head. Never re-request a failed check to see; supervisor decides an infrastructure re-request.
  5. Repeat the two independent review passes against the final head, preserve every satellite/source branch and recommend dispositions with content evidence. Return READY_FOR_MERGE only after all gates pass. Supervisor alone merges/enqueues/deploys/completes the handoff.

Operational knowledge

  • Clone under /code/ws/L40/workspace/; export PATH=/code/ws/bin:$PATH. Working tools: cs/handoff-cli/build-watchman0.0.21. System coursier binary has the wrong architecture; do not execute it. Scripts use their pinned JVM launcher. gh is authenticated; no credentials belong in artifacts.
  • Local JVMs only through /code/ws/bin/jvm-slot, below4.5GiB measured shared memory, with bounded1800s admission/selector. No local full suite/fatjar; one selector per acquisition. Run11 source compiler768m/1200s; focused compiler384m/300s and original test bounds unchanged. Minimal compiler SDK must include stdlib-transitive annotations13.0; omission caused compile-only errors, not test failures.
  • Helpers/manifests/logs under hq-artifacts/L40-run11 on evidence branch. current-main/ holds d4 source patch/plan/compiler logs; earlier files are e382/c918. No CPU spinners, timeout increases, iteration reductions, assertion weakening or retries around tests.
  • gh pr edit hit deprecated Projects(classic) GraphQL fields; structured REST PATCH of this PR body succeeded. Other PRs are untouched.
  • Track every started timeout/compiler/test/client/watcher PID and start identity, kill only owned PIDs. Check process audit before exiting. Long waits must have terminal outcomes and hard deadlines. No pattern kills.
  • Findings/report record: /tmp/claude-1000/-code/4127b3f9-6050-446f-a28d-b0511dacd396/scratchpad/hq/out/L40-findings.md and L40-report.md. Remote evidence carries snapshots for recovery after filesystem loss. The exact latest GATE section is authoritative for what remains, not historical ready claims.

Latest status report

10 reports
Running fable-hq-20261004 4127b3f9 3 minutes ago

Status report — 2026-10-09 05:39 UTC (RUNNING)

Original request: "Work through all open handoffs, delegating to codex/gpt for the heavy lifting, skip any handoffs which are already claimed. Make sure you (fable) do the final review before merging. Use your best judgement to decide how to proceed (handoffs and PRs may be obsolete or low quality or whatever) decide if they should be merged or closed or if anything from them can be salvaged. Drive them to completion. Parallelize with 6 workers who grab work off the queue (not waves). The work on one of the 6 parallel handoffs should be driven to completion before another is started."

🟡 Status: RUNNING. Seven handoffs are now claimed by this session (agent fable-hq-20261004): the six BuildTestEmbedded and kompile-buildscript handoffs each on a codex lane (five relaunched this cycle with fresh rulings), plus a seventh, unclaimed until now, that owns the fix for tonight's buildtest outage. Two Opus lanes are on the handoff-service fix and the outage fix. Nothing on the path to DONE depends on the user. The three deploy recommendations at the end are for your decision only.

Progress since the 05:04 report (the 05:31 cycle ran late because of the disk incident below)

  • Root cause of the buildtest outage, established read-only. The forensic lane finished: the resolver library that connects the buildtest coordinator to the droplet service has a 30 s per-call limit, and when one call exceeds it, the library shuts down the whole shared connection, so every other run's in-flight create or status call, and every object already returned over that connection, dies with "closed instance proxy". The droplet service's SSH-key grant legitimately blocks up to 5 minutes, so one slow-booting droplet kills every other run's provisioning. The coordinator log holds 559 such shutdowns since 16:02 yesterday, 84 percent triggered by the SSH grant. A separate, now-cleared trigger (the droplet service's timer requests to the WebCron scheduler exceeding 20 s) stopped all creation between 04:10 and 05:20. A restart would not help: the coordinator already reopens the connection, and the next slow grant brings the failure back. Two existing PRs by the other active orchestrator address exactly this: https://github.com/CodexCoder21Organization/UrlResolver/pull/1226 (make a deadline fail only its own call) and https://github.com/CodexCoder21Organization/DigitalOceanDropletServiceServer/pull/144 (make the SSH grant asynchronous), both with red CI and untouched for 13 hours and 3 days respectively. Their handoff was unclaimed, so I claimed it and dispatched lane PROV2 (Opus) to prove the mechanism with a fail-first test on main versus that PR's head, classify its 7 failing tests, and prepare any needed fixes on my own branch with a comment on the PR, never pushing to the other orchestrator's branches. Challenge records filed and merged: https://github.com/CodexCoder21Organization/PlanRepository/blob/main/challenges/2026-10-09-0521-buildtest-droplet-provisioning-broken-since-about-00-50.md (a duplicate with suffix -2 also landed because my first filing attempt raced the text file; harmless).
  • The buildtest web API is stale (it reports itself out of date; its run list ends at 01:55), so the "nothing completed since 00:12" picture was partly the stale view: the coordinator log shows two runs completed after 01:49. Still, provisioning is failing for most new runs and no PR has had a required check run end-to-end since.
  • The box's disk hit 100% at 05:20 (2.3 GB free of 309 GB), caught by lane L43's failing selector and confirmed. I deleted the checkouts and build caches of lanes that finished on 2026-10-05 and the dependency clones of finished review lanes: 37 GB free now (89%). All new briefs forbid fresh full clones. Lane L40's one storage failure (archive admission needed 5.37 GB free and saw 4.6 GB) was this incident; it had responded by adding storage margins to 16 test fixtures, which I ruled out as calibrating tests to the machine and instructed it to revert.
  • Five lanes hit their 2.5 h boxes and were relaunched with rulings: L28 (mechanism proven: an interrupted projection reader re-waits on the journal lock the publisher holds, so the interruption is lost; run 5 implements the interruptible-acquisition fix), L49 (two fixture rulings: use the public writable error-message field instead of the read-only label, and select outside the protected tail only with an identity assertion), L43 (fixtures proven both ways, 14 selectors left), L44 (24 assertions preserved, unrepaired watchdog fails 3 of 3, candidate 3 first-attempt passes, four inherited gates left), and L40 (compile proven, storage-margin patch reverted, 17 focused selectors to run with native snapshots). L47 continues toward its 06:16 box.
  • Handoff-service fix https://github.com/CodexCoder21Organization/HandoffServiceServer/pull/30: the implementing lane HSVC3 checkpointed at its box with the code complete; the re-review had closed every code item; follow-on lane HSVC4 pushed the final two nits as head 332604dd at 05:20 and is running the marshaling, proxy, storm and four neighbour tests on that exact head (it correctly noticed the neighbours must be re-run because production source changed since the last neighbour pass), plus the final storm test against both old heads. CI for this head has not dispatched (no check-run exists yet); its watcher will catch the lost dispatch. Enqueue waits on provisioning either way.
  • Merge queues: https://github.com/CodexCoder21Organization/UrlProtocol/pull/647 position 4, https://github.com/CodexCoder21Organization/UrlResolver/pull/1169 position 16; both queue runs will fail on provisioning if they reach the head before the fix lands. https://github.com/CodexCoder21Organization/UrlProtocol/pull/649's second re-requested check failed on the provisioning stall; no further retries.
  • Handoff mirror: the 05:04 report reached all six handoffs; this one goes to seven.

PRs from this session (live-verified 05:37 UTC)

✅ Merged

  • https://github.com/CodexCoder21Organization/BuildTestEmbedded/pull/1197 (2026-10-05 11:35), https://github.com/CodexCoder21Organization/BuildTestEmbedded/pull/1236 (10-04 20:50), https://github.com/CodexCoder21Organization/BuildTestEmbedded/pull/1239 (10-05 02:18), https://github.com/CodexCoder21Organization/BuildTestEmbedded/pull/1244 (10-05 14:05), https://github.com/CodexCoder21Organization/BuildTestEmbedded/pull/1248 (10-05 06:52), https://github.com/CodexCoder21Organization/BuildTestEmbedded/pull/1258 (10-05 13:40), https://github.com/CodexCoder21Organization/BuildTestWui/pull/362 (10-05 12:16), https://github.com/CodexCoder21Organization/PlanRepository/pull/10909 and https://github.com/CodexCoder21Organization/PlanRepository/pull/10910 (challenge records, 05:3x).

⏳ Pending

  • https://github.com/CodexCoder21Organization/HandoffServiceServer/pull/30 — OPEN, head 332604dd; code reviewed clean twice; local re-runs on the final head in progress; required check not yet dispatched; blocked on provisioning.
  • https://github.com/CodexCoder21Organization/UrlProtocol/pull/647 — OPEN, final review clean; merge queue position 4.
  • https://github.com/CodexCoder21Organization/UrlResolver/pull/1169 — OPEN, final review clean; merge queue position 16.
  • https://github.com/CodexCoder21Organization/UrlProtocol/pull/649 — OPEN, final review clean; remote check failed twice on infrastructure; waits for provisioning.
  • https://github.com/CodexCoder21Organization/kompile-buildscript/pull/87 — OPEN draft; L47 producing the candidate head.
  • https://github.com/CodexCoder21Organization/BuildTestEmbedded/pull/1127 (L43), https://github.com/CodexCoder21Organization/BuildTestEmbedded/pull/1130 (L44), https://github.com/CodexCoder21Organization/BuildTestEmbedded/pull/1207 (L49), https://github.com/CodexCoder21Organization/BuildTestEmbedded/pull/1213 (L40) — OPEN, need rebase, lanes relaunched.
  • https://github.com/CodexCoder21Organization/UrlResolver/pull/1185 — OPEN; waits on protocol 0.0.605 from https://github.com/CodexCoder21Organization/UrlProtocol/pull/637 (other orchestrator).
  • Not mine, under verification by PROV2: https://github.com/CodexCoder21Organization/UrlResolver/pull/1226 (OPEN, remote check 1885 passed / 7 failed, build failing) and https://github.com/CodexCoder21Organization/DigitalOceanDropletServiceServer/pull/144 (OPEN, all-tests failing).

Delegated work at a glance

⏳ Running - GPT 6.1-sol high - 1 hour 52 minutes total time - 5 minutes since last update - Lane L47 run 6 on https://github.com/CodexCoder21Organization/kompile-buildscript/pull/87. Repaired fixture executing under the original bound; diagnostic and negative variants queued; no behavior repair applied yet. Next checkpoint: the verdicts, or CHECKPOINT at 06:16.

⏳ Running - GPT 6.1-sol high - 15 minutes total time - launching/claiming - Lane L28 run 5: finish three current-main bodies, implement the interruptible-acquisition fix at the one blocking primitive, flip the bodies, open the WHY-first PR. Next checkpoint: the mechanism statement and third-body results.

⏳ Running - GPT 6.1-sol high - 15 minutes total time - launching/claiming - Lane L49 run C on https://github.com/CodexCoder21Organization/BuildTestEmbedded/pull/1207 with both fixture rulings. Next checkpoint: both fixtures proven three ways.

⏳ Running - GPT 6-astra high - 5 minutes total time - launching/claiming - Lane L43 run 13 on https://github.com/CodexCoder21Organization/BuildTestEmbedded/pull/1127: re-run the disk-failed selector post-restoration, then the 14 remaining selectors. Next checkpoint: first selector results.

⏳ Running - GPT 6-astra high - 5 minutes total time - launching/claiming - Lane L44 run 12 on https://github.com/CodexCoder21Organization/BuildTestEmbedded/pull/1130: re-claim, four remaining inherited gates, two saved public experiments. Next checkpoint: the four gate results.

⏳ Running - GPT 6.1-sol high - 2 minutes total time - launching - Lane L40 run 13 on https://github.com/CodexCoder21Organization/BuildTestEmbedded/pull/1213: revert the storage-margin patch, run 17 focused selectors with native snapshots. Next checkpoint: the first held-scenario diagnostic.

⏳ Running - Opus medium - 23 minutes total time - 5 minutes since last update - Agent lane HSVC4 on https://github.com/CodexCoder21Organization/HandoffServiceServer/pull/30: nit head pushed; marshaling, proxy, storm, four neighbours and the two old-head storm runs queued on JVM slots. Next checkpoint: first-attempt verdicts and the filled results table.

⏳ Running - Opus medium - 3 minutes total time - just launched - Agent lane PROV2 on the buildtest outage fix: fail-first test for the connection-shutdown mechanism on main versus https://github.com/CodexCoder21Organization/UrlResolver/pull/1226, classification of its 7 failing tests, fixes on my own branch, one factual comment on the PR. Next checkpoint: the fail-first verdicts.

⚪ Not running (finished) - Opus medium - 10 minutes total time - 11 minutes since last update - Agent lane BTPROV1 read-only forensic: GATE ROOT_CAUSE with the mechanism, evidence, blast radius, existing PRs and the recommendation above. Nothing further expected.

⚪ Not running (finished) - Opus medium - 2 hours 32 minutes total time - 13 minutes since last update - Agent lane HSVC3: implemented and proved the handoff-service fix, closed every review finding, checkpointed; resume steps owned by HSVC4. Nothing further expected.

⚪ Not running (finished) - GPT 6 lanes L28 run 4, L49 run B, L43 run 12, L44 run 11, L40 run 12 - each ended at its 2.5 h box as CHECKPOINT or NEEDS_USER with the evidence summarized above; each replaced by the run listed above. Nothing further expected from these invocations.

Changes since last report: five codex lanes checkpointed and relaunched with rulings; BTPROV1 finished with a root cause; PROV2 launched on a newly claimed seventh handoff; the disk was pruned.

How the fixes work

Handoff service: The service crashed in a loop because each client connection asked for its bytecode and the handler base64-encoded a 2 MB jar plus a 0.7 MB stdlib jar fresh every time, about 10 MB of garbage per request in a 128 MB heap, while a slow consumer left several replies queued unsent. The fix drops the base64 path entirely: the protocol answers the bytecode request itself with a small header plus the jar as one binary attachment that is the same array for every reply, so sixteen queued replies hold one copy and fit both the heap and the outbox ceiling. The deciding test launches the real server entry point in a child JVM with production heap flags, seeds 20 MB of handoff bodies, and has 16 raw wire clients hold their replies unread until the server has answered all of them; it fails on the old code and on encode-once, and passes on streamed.

Buildtest provisioning (PROV2, verifying another orchestrator's PR): One slow call on the coordinator's shared connection to the droplet service makes the resolver library shut the whole connection down, killing every other run's provisioning. The fix makes a per-call deadline fail only its own call and keep the connection and previously returned objects usable, with a second PR making the slow SSH-key grant asynchronous so the deadline is rarely hit at all. The fail-first test holds a returned object in one thread while another thread's call blocks past the limit, then reads the held object: it must return the value, not "closed instance proxy".

Interrupted projection readers (L28): An interrupted snapshot reader re-waits on the journal lock the publisher holds, so the interruption is lost and the reader blocks instead of returning the advertised reset with its cause. The fix makes the reader's lock acquisition interruptible at that one blocking primitive and carries the original cause into the recovery log. Two first-attempt failures on unchanged main are the before-evidence; the same bodies must pass after, and a variant without the interruptible acquisition must fail again.

Blockers

🟡 None requiring the user; one production outage is throttling the pipeline and its fix is now being driven (PROV2). I will not restart production services; the forensic result says a restart would not help anyway. Standing deploy recommendations, your decision only: (1) deploy kotlin-build-ci 0.0.109; (2) deploy the buildtest coordinator after https://github.com/CodexCoder21Organization/BuildTestEmbedded/pull/1213 lands, and after the resolver fix from https://github.com/CodexCoder21Organization/UrlResolver/pull/1226 is pinned; (3) deploy the handoff service once https://github.com/CodexCoder21Organization/HandoffServiceServer/pull/30 lands and 0.0.28 is published.

Plan changes and self-check

Plan changes: a seventh handoff (the outage fix) was pulled onto an Opus lane because it is the artifact every other PR's required check waits on; remote-suite steps are gated on observed provisioning recovery; fresh full clones are forbidden. Progress is real: a root cause with source-level evidence, five lanes advanced to their next proofs, the handoff-service fix at its last gates. Landing parallelization sweep: on https://github.com/CodexCoder21Organization/HandoffServiceServer/pull/30 all gates but CI are done and CI waits on provisioning; the queued PRs have only their runs left; the outage fix's own gates (fail-first proof, classification) started this cycle. No idle runnable gate.

Next steps: prove and land the resolver fix so CI provisions again, then land the handoff-service fix and publish 0.0.28, watch the queued PRs through, drive the six codex lanes to READY_FOR_REVIEW, review and enqueue each green head, complete each handoff, then pull the next unclaimed handoffs onto free slots.

Top-three lessons learned

  1. When every PR's CI goes red at once, investigate the shared service before touching any PR. Three "distinct" infrastructure failures on one PR and a dead-looking pool turned out to be one mechanism in a shared library; a read-only forensic lane found it in ten minutes from the coordinator's logs and the library source, and found the fix already written in an unclaimed handoff. Retrying checks would have burned the day.
  2. Watch the disk as a shared resource of the lane pool, not per lane. Six lanes each cloning repositories and filling build caches took the box from 91% to 100% in five hours, broke a selector, and tempted a lane into "fixing" fixtures for a full host; check free space every cycle and delete finished lanes' checkouts and caches together.
  3. Reproduce the condition in the dump, not the traffic you imagine. A heap dump showing replies queued unsent names a slow consumer as the trigger; fast loopback clients can never create that state, so a storm test built from them passes on broken code. Read the dump for the condition and force it deterministically; that test rejected a fix that had passed every softer test.

Earlier reports

Running fable-hq-20261004 4127b3f9 11 minutes ago
Running fable-hq-20261004 4127b3f9 41 minutes ago
Running fable-hq-20261004 4127b3f9 1 hour ago
Running fable-hq-20261004 4127b3f9 1 hour ago
Running fable-hq-20261004 4127b3f9 1 hour ago
Running fable-hq-20261004 4127b3f9 2 hours ago
Running fable-hq-20261004 4127b3f9 2 hours ago
Running fable-hq-20261004 4127b3f9 2 hours ago
Running fable-hq-20261004 4127b3f9 2 hours ago
Show fewer

Add dependency

Complete this handoff

Moves it out of every priority list and into ArchiveArea.